{"text_format":"1","workbook":"xlsx","n_sheets":5,"sheets":["Divisions List","2020 Census","Cover Sheet","UC Agreement Forecasting","Appendix"],"not_rendered":{"charts":0,"images":18,"macros":1,"external_links":0,"defined_names":17,"comments":0,"pivot_tables":0},"unopened":[],"bounds":{"document_bytes":16777216,"sheet_cells":100000,"rows_first":2000,"rows_last":500,"rows_between":2000,"halvings":0,"cell_chars":16384,"cell_head_chars":4096},"cells_cut":0,"cells_raw":0,"read":"whole","date_system":"1900"}

{"sheet":"Divisions List","index":0,"n_rows":32,"n_cols":21,"rows_kept":32,"cut":false,"hidden":false,"merged":[[1,19,1,20],[15,1,15,2],[15,4,15,5],[15,7,15,8],[15,10,15,11],[15,13,15,14],[15,16,15,17],[15,19,15,20],[1,1,1,2],[1,4,1,5],[1,7,1,8],[1,10,1,11],[1,13,1,14],[1,16,1,17]]}
[]
[null,"Division 1",null,null,"Division 2",null,null,"Division 3",null,null,"Division 4",null,null,"Division 5",null,null,"Division 6",null,null,"Division 7"]
[null,"Elizabeth City",18631,null,"Greenville",87521,null,"Wilmington",115451,null,"Rocky Mount",54341,null,"Raleigh",467665,null,"Fayetteville",208501,null,"Greensboro",299035]
[null,null,null,null,"New Bern",31291,null,"Jacksonville",72723,null,"Wilson",47851,null,"Durham",283506,null,"Lumberton",19025,null,"High Point",114059]
[null,null,null,null,"Kinston",19900,null,"Leland",22908,null,"Goldsboro",33657,null,"Cary",174721,null,"Hope Mills",17808,null,"Chapel Hill",61960]
[null,null,null,null,"Havelock",16621,null,null,null,null,"Clayton",26307,null,"Apex",58780,null,"Spring Lake",11660,null,"Burlington",57303]
[null,null,null,null,"Winterville",10462,null,null,null,null,"Roanoke Rapids",15229,null,"Wake Forest",47601,null,null,null,null,"Carrboro",21295]
[null,null,null,null,null,null,null,null,null,null,"Smithfield",11292,null,"Holly Springs",41239,null,null,null,null,"Mebane",17797]
[null,null,null,null,null,null,null,null,null,null,"Tarboro",10721,null,"Fuquay-Varina",34152,null,null,null,null,"Graham",17157]
[null,null,null,null,null,null,null,null,null,null,null,null,null,"Garner",31159,null,null,null,null,"Eden",15421]
[null,null,null,null,null,null,null,null,null,null,null,null,null,"Morrisville",29630,null,null,null,null,"Reidsville",14583]
[null,null,null,null,null,null,null,null,null,null,null,null,null,"Knightdale",19435,null,null,null,null,"Archdale",11907]
[null,null,null,null,null,null,null,null,null,null,null,null,null,"Henderson",15060,null,null,null,null,"Elon",11336]
[null,null,null,null,null,null,null,null,null,null,null,null,null,null,null,null,null,null,null,"Summerfield",10951]
[]
[null,"Division 8",null,null,"Division 9",null,null,"Division 10",null,null,"Division 11",null,null,"Division 12",null,null,"Division 13",null,null,"Division 14"]
[null,"Sanford",30261,null,"Winston-Salem",249545,null,"Charlotte",874579,null,"Boone",19092,null,"Gastonia",80411,null,"Asheville",94589,null,"Hendersonville",15137]
[null,"Asheboro",27156,null,"Kannapolis",53114,null,"Concord",105240,null,"Lenoir",18352,null,"Mooresville",50193,null,"Morganton",17474,null,"Waynesville",10140]
[null,"Pinehurst",17581,null,"Salisbury",35540,null,"Huntersville",61376,null,"Mount Airy",10676,null,"Hickory",43490]
[null,"Southern Pines",15545,null,"Thomasville",27183,null,"Kannapolis",53114,null,null,null,null,"Statesville",28419]
[null,"Laurinburg",14978,null,"Kernersville",26449,null,"Indian Trail",39997,null,null,null,null,"Shelby",21918]
[null,"Archdale",11907,null,"Clemmons",21163,null,"Monroe",34562,null,null,null,null,"Mount Holly",17703]
[null,null,null,null,"Lexington",19632,null,"Cornelius",31412,null,null,null,null,"Belmont",15010]
[null,null,null,null,"Lewisville",13381,null,"Matthews",29435,null,null,null,null,"Newton",13148]
[null,null,null,null,null,null,null,"Mint Hill",26450,null,null,null,null,"Kings Mountain",11142]
[null,null,null,null,null,null,null,"Waxhaw",20534,null,null,null,null,"Lincolnton",11091]
[null,null,null,null,null,null,null,"Harrisburg",18967]
[null,null,null,null,null,null,null,"Albemarle",16432]
[null,null,null,null,null,null,null,"Stallings",16112]
[null,null,null,null,null,null,null,"Davidson",15106]
[null,null,null,null,null,null,null,"Weddington",13181]
[null,null,null,null,null,null,null,"Pineville",10602]

{"sheet":"2020 Census","index":1,"n_rows":555,"n_cols":10,"rows_kept":555,"cut":false,"hidden":false,"merged":[]}
["Census Code","Name","Population 2020","Population 2010","Name Prefix","Notes","NCDOT COST","UTILITY OWNER COST","Div","NOTES"]
[3712000,"Charlotte",874579,731424,"City of",null,0,1,10,"A municipality with a population of 100,000 or greater, shall pay  one hundred percent (100%) of the cost."]
[3755000,"Raleigh",467665,403892,"City of",null,0,1,5,"A municipality with a population of 50,000 or greater, but less than 100,000, shall pay  fifty percent (50%) of the cost."]
[3728000,"Greensboro",299035,269666,"City of",null,0.5,1,7,"A municipality with a population of greater than 25,000, but less than 50,000, shall pay  twenty-five percent (25%) of the cost"]
[3719000,"Durham",283506,228330,"City of",null,null,null,5,"twenty-five percent (25%) of the cost"]
[3775000,"Winston-Salem",249545,229617,"City of",null,null,1,9]
[3722920,"Fayetteville",208501,200564,"City of",null,null,null,6,"A municipality with a population of 25,000 or less, shall pay  zero percent (0%) of the cost."]
[3710740,"Cary",174721,135234,"Town of",null,null,null,5]
[3774440,"Wilmington",115451,106476,"City of",null,null,null,3,"City of Concord has 100 percent cost with the exception of previous infrastructure built and in service under"]
[3731400,"High Point",114059,104371,"City of",null,null,1,7]
[3714100,"Concord",105240,79066,"City of","75%->100%",0,1,10]
[3702140,"Asheville",94589,83393,"City of",null,0.5,0.5,13]
[3728080,"Greenville",87521,84554,"City of",null,null,null,2,"Board of Light and Water Commission then NCDOT responsible for 100 percent of the cost"]
[3725580,"Gastonia",80411,71741,"City of",null,0.5,0.5]
[3734200,"Jacksonville",72723,70145,"City of",null,null,null,2]
[3711800,"Chapel Hill",61960,57233,"Town of",null,null,0.5,7]
[3733120,"Huntersville",61376,46773,"Town of","25%->50%",0.5,0.5,10]
[3701520,"Apex",58780,37476,"Town of","25%->50%",null,null,5,"A municipality with a population of 100,000 or greater shall pay one hundred percent (100%) of the cost"]
[3709060,"Burlington",57303,49963,"City of","25%->50%",null,0.5,7]
[3757500,"Rocky Mount",54341,57477,"City of",null,null,null,4]
[3735200,"Kannapolis",53114,42625,"City of","25%->50%",0.5,0.5,10]
[3744220,"Mooresville",50193,32711,"Town of","25%->50%",0.5,0.5,10]
[3774540,"Wilson",47851,49167,"City of",null,null,null,4]
[3770540,"Wake Forest",47601,30117,"Town of",null,null,null,5]
[3731060,"Hickory",43490,40010,"City of",null,0.75,0.25]
[3732260,"Holly Springs",41239,24661,"Town of",null,null,null,5]
[3733560,"Indian Trail",39997,33518,"Town of",null,0.75,0.25,10]
[3758860,"Salisbury",35540,33662,"City of",null,0.75,0.25]
[3743920,"Monroe",34562,32797,"City of",null,0.75,0.25,10]
[3725300,"Fuquay-Varina",34152,17937,"Town of",null,null,null,5]
[3726880,"Goldsboro",33657,36437,"City of",null,null,null,4]
[3714700,"Cornelius",31412,24866,"Town of",null,0.75,0.25]
[3746340,"New Bern",31291,29524,"City of",null,null,null,2]
[3725480,"Garner",31159,25745,"Town of",null,null,null,5]
[3759280,"Sanford",30261,28094,"City of",null,0.75,0.25]
[3744520,"Morrisville",29630,18576,"Town of",null,0.75,0.25]
[3741960,"Matthews",29435,27198,"Town of",null,0.75,0.25]
[3764740,"Statesville",28419,24532,"City of",null,0.75,0.25]
[3767420,"Thomasville",27183,26757,"City of",null,0.75,0.25]
[3702080,"Asheboro",27156,25012,"City of",null,0.75,0.25]
[3743480,"Mint Hill",26450,22722,"Town of",null,0.75,0.25]
[3735600,"Kernersville",26449,23123,"Town of",null,0.75,0.25]
[3712860,"Clayton",26307,16116,"Town of",null,0.75,0.25]
[3737680,"Leland",22908,13527,"Town of",null,0.75,0.25]
[3761200,"Shelby",21918,20323,"City of",null,0.75,0.25]
[3710620,"Carrboro",21295,19582,"Town of",null,0.75,0.25]
[3712960,"Clemmons",21163,18627,"Village of",null,0.75,0.25]
[3771460,"Waxhaw",20534,9859,"Town of","0%->25%",0.75,0.25,10]
[3735920,"Kinston",19900,21677,"City of",null,null,null,2]
[3738060,"Lexington",19632,18931,"City of",null,0.75,0.25]
[3736080,"Knightdale",19435,11401,"Town of",null,null,null,5]
[3707080,"Boone",19092,17122,"Town of",null,0.75,0.25]
[3739700,"Lumberton",19025,21542,"City of",null,null,null,6]
[3729800,"Harrisburg",18967,11526,"Town of",null,0.75,0.25]
[3720580,"Elizabeth City",18631,18683,"City of",null,null,null,1]
[3737760,"Lenoir",18352,18228,"City of",null,0.75,0.25]
[3732640,"Hope Mills",17808,15176,"Town of",null,0.75,0.25]
[3742240,"Mebane",17797,11393,"City of",null,0.75,0.25,7]
[3744960,"Mount Holly",17703,13656,"City of",null,0.75,0.25]
[3751940,"Pinehurst",17581,13124,"Village of",null,0.75,0.25]
[3744400,"Morganton",17474,16918,"City of",null,0.75,0.25]
[3727280,"Graham",17157,14153,"City of",null,0.75,0.25,7]
[3730120,"Havelock",16621,20735,"City of",null,null,null,2]
[3700680,"Albemarle",16432,15903,"City of",null,0.75,0.25,10]
[3764420,"Stallings",16112,13831,"Town of",null,0.75,0.25]
[3763120,"Southern Pines",15545,12334,"Town of",null,0.75,0.25]
[3720080,"Eden",15421,15527,"City of",null,0.75,0.25]
[3756900,"Roanoke Rapids",15229,15754,"City of",null,0.75,0.25]
[3730720,"Hendersonville",15137,13137,"City of",null,0.75,0.25]
[3716400,"Davidson",15106,10944,"Town of",null,0.75,0.25]
[3730660,"Henderson",15060,15368,"City of",null,0.75,0.25]
[3704840,"Belmont",15010,10076,"City of",null,0.75,0.25]
[3737220,"Laurinburg",14978,15962,"City of",null,0.75,0.25]
[3755900,"Reidsville",14583,14520,"City of",null,0.75,0.25]
[3738040,"Lewisville",13381,12639,"Town of",null,0.75,0.25]
[3771680,"Weddington",13181,9459,"Town of","0%->25%",0.75,0.25,10]
[3747000,"Newton",13148,12968,"City of",null,0.75,0.25]
[3701720,"Archdale",11907,11415,"City of",null,0.75,0.25]
[3764180,"Spring Lake",11660,11964,"Town of",null,0.75,0.25]
[3721095,"Elon",11336,9419,"Town of","0%->25%",0.75,0.25,7]
[3762520,"Smithfield",11292,10966,"Town of",null,0.75,0.25]
[3735880,"Kings Mountain",11142,10296,"City of",null,0.75,0.25]
[3738320,"Lincolnton",11091,10486,"City of",null,0.75,0.25]
[3765580,"Summerfield",10951,10232,"Town of",null,0.75,0.25]
[3766700,"Tarboro",10721,11415,"Town of",null,0.75,0.25]
[3744800,"Mount Airy",10676,10388,"City of",null,0.75,0.25]
[3752220,"Pineville",10602,7479,"Town of","0%->25%",0.75,0.25,10]
[3775060,"Winterville",10462,9269,"Town of","0%->25%",null,null,2]
[3771500,"Waynesville",10140,9869,"Town of","0%->25%",0.75,0.25,14]
[3771220,"Washington",9875,9744,"City of",null,null,null,2]
[3771860,"Wendell",9793,5845,"Town of",null,null,null,5]
[3731620,"Hillsborough",9660,6087,"Town of",null,1,0,7]
[3744320,"Morehead City",9556,8661,"Town of",null,null,null,2]
[3757640,"Rolesville",9475,3786,"Town of",null,null,null,5]
[3757260,"Rockingham",9243,9558,"City of",null,null,null,8]
[3725980,"Gibsonville",8920,6410,"Town of",null,1,0,7]
[3771940,"Wesley Chapel",8681,7463,"Village of",null,1,0]
[3749800,"Oxford",8628,8461,"City of",null,1,0]
[3700160,"Aberdeen",8516,6350,"Town of",null,null,null,8]
[3718320,"Dunn",8446,9263,"City of",null,null,null,6]
[3706140,"Black Mountain",8426,7848,"Town of",null,1,0,13]
[3714340,"Conover",8421,8165,"City of",null,1,0]
[3709360,"Butner",8397,7591,"Town of",null,1,0]
[3748345,"Oak Island",8396,6783,"Town of",null,1,0]
[3713240,"Clinton",8383,8639,"City of",null,null,null,3]
[3758160,"Roxboro",8134,8362,"City of",null,1,0]
[3723760,"Fletcher",7987,7187,"Town of",null,1,0]
[3775280,"Woodfin",7936,6123,"Town of",null,1,0]
[3707720,"Brevard",7744,7609,"City of",null,1,0]
[3741420,"Marion",7717,7838,"City of",null,1,0,13]
[3761860,"Siler City",7702,7887,"Town of",null,1,0]
[3735720,"Kill Devil Hills",7656,6683,"Town of",null,null,null,1]
[3748480,"Oak Ridge",7474,6185,"Town of",null,1,0]
[3724080,"Forest City",7377,7476,"Town of",null,1,0]
[3735760,"King",7197,6904,"City of",null,1,0]
[3743260,"Mills River",7078,6802,"Town of",null,1,0]
[3768400,"Trinity",7006,6614,"City of",null,1,0]
[3776220,"Zebulon",6903,4433,"Town of",null,null,null,5]
[3769260,"Unionville",6643,5929,"Town of",null,1,0]
[3710500,"Carolina Beach",6564,5706,"Town of",null,null,null,3]
[3758630,"St. James",6529,3165,"Town of",null,null,null,3]
[3741720,"Marvin",6358,5579,"Village of",null,1,0]
[3760320,"Selma",6317,6073,"Town of",null,null,null,4]
[3712340,"Cherryville",6078,5760,"City of",null,1,0]
[3729160,"Hamlet",6025,6495,"City of",null,null,null,8]
[3706760,"Boiling Spring Lakes",5943,5372,"City of",null,1,0]
[3716180,"Dallas",5927,4488,"Town of",null,1,0]
[3765040,"Stokesdale",5924,5047,"Town of",null,1,0]
[3743720,"Mocksville",5900,5051,"Town of",null,1,0]
[3770660,"Walkertown",5692,4675,"Town of",null,1,0]
[3746000,"Nashville",5632,5352,"Town of",null,null,null,4]
[3705220,"Bessemer City",5428,5340,"City of",null,1,0]
[3715260,"Cramerton",5296,4165,"Town of",null,1,0]
[3701400,"Angier",5265,4350,"Town of",null,null,null,6]
[3774220,"Williamston",5248,5511,"Town of",null,1,0]
[3739280,"Long View",5088,4871,"Town of",null,1,0]
[3759540,"Sawmills",5020,5240,"Town of",null,1,0]
[3770380,"Wadesboro",5008,5813,"Town of",null,1,0]
[3752760,"Pleasant Garden",5000,4489,"Town of",null,1,0]
[3773140,"Whispering Pines",4987,2928,"Village of",null,1,0]
[3702840,"Ayden",4977,4932,"Town of",null,1,0]
[3727420,"Granite Falls",4965,4722,"Town of",null,1,0]
[3700500,"Ahoskie",4891,5039,"Town of",null,null,null,1]
[3715320,"Creedmoor",4866,4124,"City of",null,1,0]
[3701760,"Archer Lodge",4797,4292,"Town of",null,1,0]
[3773660,"Whiteville",4766,5394,"City of",null,1,0]
[3742860,"Midway",4742,4679,"Town of",null,1,0]
[3738220,"Lillington",4735,3194,"Town of",null,null,null,6]
[3769520,"Valdese",4689,4490,"Town of",null,1,0]
[3742760,"Midland",4684,3073,"Town of",null,1,0]
[3706800,"Boiling Springs",4615,4647,"Town of",null,1,0]
[3755080,"Randleman",4595,4113,"City of",null,1,0]
[3710550,"Carolina Shores",4588,3048,"Town of",null,1,0]
[3771560,"Weaverville",4567,3120,"Town of",null,1,0]
[3754580,"Raeford",4559,4611,"City of",null,1,0]
[3721740,"Erwin",4542,4405,"Town of",null,null,null,6]
[3738860,"Locust",4537,2930,"City of",null,1,0]
[3752660,"Pittsboro",4537,3743,"Town of",null,1,0]
[3755260,"Ranlo",4511,3434,"Town of",null,1,0]
[3704260,"Beaufort",4464,4039,"Town of",null,null,null,2]
[3722820,"Farmville",4461,4654,"Town of",null,null,null,2]
[3720120,"Edenton",4460,5004,"Town of",null,1,0]
[3712480,"China Grove",4434,3563,"Town of",null,1,0]
[3710240,"Canton",4422,4227,"Town of",null,1,0]
[3747880,"North Wilkesboro",4382,4245,"Town of",null,1,0,11]
[3746860,"Newport",4364,4150,"Town of",null,1,0]
[3763880,"Spindale",4225,4321,"Town of",null,1,0]
[3745100,"Mount Olive",4198,4589,"Town of",null,1,0]
[3760800,"Shallotte",4185,3675,"Town of",null,1,0]
[3724640,"Franklin",4175,3845,"Town of",null,1,0]
[3765900,"Sunset Beach",4175,3572,"Town of",null,1,0]
[3732180,"Holly Ridge",4171,1268,"Town of",null,1,0]
[3720620,"Elkin",4122,4001,"Town of",null,1,0]
[3768340,"Trent Woods",4074,4155,"Town of",null,1,0]
[3774760,"Wingate",4055,3491,"Town of",null,1,0]
[3763400,"Southport",3971,2833,"City of",null,null,null,3]
[3705040,"Benson",3967,3311,"Town of",null,1,0]
[3764500,"Stanley",3963,3556,"Town of",null,1,0]
[3766040,"Surf City",3867,1853,"Town of",null,null,null,2]
[3721160,"Emerald Isle",3847,3655,"Town of",null,1,0]
[3766520,"Tabor City",3781,2511,"Town of",null,1,0]
[3732980,"Hudson",3780,3776,"Town of",null,1,0]
[3766360,"Swansboro",3744,2663,"Town of",null,1,0]
[3740660,"Maiden",3736,3310,"Town of",null,1,0]
[3725380,"Gamewell",3702,4051,"Town of",null,1,0]
[3768500,"Troutman",3698,2383,"Town of",null,1,0]
[3736860,"Landis",3690,3109,"Town of",null,1,0]
[3736060,"Kitty Hawk",3689,3272,"Town of",null,1,0]
[3774020,"Wilkesboro",3687,3413,"Town of",null,1,0]
[3734300,"Jamestown",3668,3382,"Town of",null,1,0]
[3719740,"Eastover",3656,3628,"Town of",null,1,0]
[3739480,"Lowell",3654,3526,"City of",null,1,0]
[3758460,"Rutherfordton",3640,4213,"Town of",null,1,0]
[3774680,"Windsor",3582,3630,"Town of",null,null,null,1]
[3723600,"Flat Rock",3486,3114,"Village of",null,1,0]
[3722500,"Fairview",3456,3324,"Town of",null,1,0]
[3770720,"Wallace",3413,3880,"Town of",null,null,null,3]
[3758360,"Rural Hall",3351,2937,"Town of",null,1,0]
[3755640,"Red Oak",3342,3430,"Town of",null,1,0]
[3753040,"Plymouth",3320,3878,"Town of",null,1,0]
[3763760,"Spencer",3308,3267,"Town of",null,1,0]
[3720600,"Elizabethtown",3296,3583,"Town of",null,1,0]
[3736512,"Lake Park",3269,3422,"Village of",null,1,0]
[3745880,"Nags Head",3168,2757,"Town of",null,null,null,1]
[3743360,"Mineral Springs",3159,2639,"Town of",null,1,0]
[3727870,"Green Level",3152,2100,"Town of",null,1,0]
[3705135,"Bermuda Run",3120,1725,"Town of",null,1,0]
[3763130,"Southern Shores",3090,2714,"Town of",null,1,0]
[3708960,"Burgaw",3088,3872,"Town of",null,null,null,3]
[3755660,"Red Springs",3087,3428,"Town of",null,1,0]
[3739360,"Louisburg",3064,3359,"Town of",null,1,0]
[3770740,"Wallburg",3051,3047,"Town of",null,1,0]
[3775960,"Yadkinville",2995,2959,"Town of",null,1,0]
[3727440,"Granite Quarry",2984,2930,"Town of",null,1,0]
[3756710,"River Bend",2902,3119,"Town of",null,1,0]
[3768520,"Troy",2850,3189,"Town of",null,1,0]
[3751080,"Pembroke",2823,2973,"Town of",null,1,0]
[3710680,"Carthage",2775,2205,"Town of",null,1,0]
[3771160,"Warsaw",2733,3054,"Town of",null,null,null,3]
[3709530,"Cajah's Mountain",2722,2823,"Town of",null,1,0]
[3771900,"Wentworth",2662,2807,"Town of",null,1,0]
[3738100,"Liberty",2655,2656,"Town of",null,1,0]
[3745640,"Murfreesboro",2619,2835,"Town of",null,1,0]
[3736400,"La Grange",2595,2873,"Town of",null,1,0]
[3766500,"Sylva",2578,2588,"Town of",null,1,0,14]
[3767720,"Tobaccoville",2578,2441,"Village of",null,1,0]
[3774580,"Wilson's Mills",2534,2277,"Town of",null,1,0]
[3741640,"Marshville",2522,2402,"Town of",null,1,0]
[3775820,"Wrightsville Beach",2473,2477,"Town of",null,null,null,3]
[3724720,"Franklinton",2456,2023,"Town of",null,1,0]
[3728200,"Grifton",2448,2617,"Town of",null,null,null,2]
[3766460,"Swepsonville",2445,1154,"Town of",null,1,0]
[3742060,"Mayodan",2418,2478,"Town of",null,1,0]
[3704950,"Belville",2406,1936,"Town of",null,1,0]
[3747980,"Norwood",2367,2379,"Town of",null,1,0]
[3766960,"Taylorsville",2320,2098,"Town of",null,1,0]
[3734840,"Jonesville",2308,2285,"Town of",null,1,0]
[3757340,"Rockwell",2302,2108,"Town of",null,1,0]
[3756360,"Richlands",2287,1520,"Town of",null,1,0]
[3730260,"Haw River",2252,2298,"Town of",null,1,0]
[3737160,"Laurel Park",2250,2180,"Town of",null,1,0]
[3753140,"Polkton",2250,3375,"Town of",null,1,0]
[3710260,"Cape Carteret",2224,1917,"Town of",null,1,0]
[3764260,"Spruce Pine",2194,2175,"Town of",null,1,0]
[3736220,"Kure Beach",2191,2012,"Town of",null,null,null,3]
[3722360,"Fairmont",2191,2663,"Town of",null,1,0]
[3724520,"Four Oaks",2158,1921,"Town of",null,1,0]
[3713360,"Coats",2155,2112,"Town of",null,1,0]
[3740560,"Madison",2129,2246,"Town of",null,1,0]
[3748040,"Oakboro",2128,1859,"Town of",null,1,0]
[3742020,"Maxton",2110,2426,"Town of",null,1,0]
[3752020,"Pine Level",2046,1700,"Town of",null,1,0]
[3758720,"St. Pauls",2045,2035,"Town of",null,null,null,6]
[3702960,"Badin",2024,1974,"Town of",null,1,0]
[3776200,"Youngsville",2016,1157,"Town of",null,1,0]
[3709540,"Calabash",2011,1786,"Town of",null,null,null,3]
[3741620,"Mars Hill",2007,1869,"Town of",null,1,0]
[3776000,"Yanceyville",1937,2039,"Town of",null,1,0]
[3730900,"Hertford",1934,2143,"Town of",null,null,null,1]
[3721360,"Enfield",1865,2532,"Town of",null,1,0]
[3706000,"Biscoe",1848,1700,"Town of",null,1,0]
[3763680,"Sparta",1834,1770,"Town of",null,1,0]
[3755040,"Ramseur",1774,1692,"Town of",null,1,0]
[3711340,"Cedar Point",1764,1279,"Town of",null,1,0]
[3717860,"Drexel",1760,1858,"Town of",null,1,0]
[3761060,"Sharpsburg",1697,2024,"Town of",null,1,0]
[3712720,"Claremont",1692,1352,"City of",null,1,0]
[3740600,"Maggie Valley",1687,1150,"Town of",null,1,0]
[3731500,"Hildebran",1679,2023,"Town of",null,1,0]
[3745140,"Mount Pleasant",1671,1652,"Town of",null,1,0]
[3701380,"Andrews",1667,1781,"Town of",null,1,0]
[3706240,"Bladenboro",1648,1750,"Town of",null,1,0]
[3759780,"Scotland Neck",1640,2059,"Town of",null,1,0]
[3734440,"Jefferson",1622,1611,"Town of",null,1,0]
[3709140,"Burnsville",1614,1693,"Town of",null,1,0]
[3730620,"Hemby Bridge",1614,1520,"Town of",null,1,0]
[3745660,"Murphy",1608,1627,"Town of",null,1,0,14]
[3741060,"Manteo",1600,1434,"Town of",null,null,null,1]
[3770780,"Walnut Cove",1586,1425,"Town of",null,1,0]
[3764460,"Stanfield",1585,1486,"Town of",null,1,0]
[3711640,"Chadbourn",1574,1856,"Town of",null,1,0]
[3719860,"East Spencer",1567,1534,"Town of",null,1,0]
[3768580,"Tryon",1562,1646,"Town of",null,1,0]
[3708480,"Bryson City",1558,1424,"Town of",null,1,0,14]
[3714280,"Connelly Springs",1529,1669,"Town of",null,1,0,11]
[3726200,"Glen Alpine",1529,1517,"Town of",null,1,0]
[3716980,"Denton",1494,1636,"Town of",null,1,0]
[3735540,"Kenly",1491,1339,"Town of",null,1,0]
[3762760,"Snow Hill",1481,1595,"Town of",null,1,0]
[3751840,"Pinebluff",1473,1337,"Town of",null,1,0]
[3717340,"Dobson",1462,1586,"Town of",null,1,0]
[3771780,"Weldon",1444,1655,"Town of",null,1,0]
[3751820,"Pilot Mountain",1440,1477,"Town of",null,1,0]
[3704640,"Belhaven",1410,1688,"Town of",null,1,0]
[3705880,"Biltmore Forest",1409,1343,"Town of",null,1,0]
[3752000,"Pine Knoll Shores",1388,1339,"Town of",null,null,null,2]
[3706500,"Blowing Rock",1376,1241,"Town of",null,1,0]
[3705460,"Bethel",1373,1577,"Town of",null,1,0]
[3757860,"Rose Hill",1371,1626,"Town of",null,1,0]
[3713280,"Clyde",1368,1223,"Town of",null,1,0]
[3746060,"Navassa",1367,1505,"Town of",null,1,0]
[3736500,"Lake Lure",1365,1192,"Town of",null,1,0]
[3702500,"Atlantic Beach",1364,1495,"Town of",null,null,null,2]
[3753820,"Princeton",1315,1194,"Town of",null,1,0]
[3764160,"Spring Hope",1309,1320,"Town of",null,null,null,6]
[3765100,"Stoneville",1308,1056,"Town of",null,1,0]
[3736640,"Lake Waccamaw",1296,1480,"Town of",null,1,0]
[3724570,"Foxfire",1288,902,"Village of",null,1,0]
[3772540,"West Jefferson",1279,1299,"Town of",null,1,0]
[3764840,"Stedman",1277,1028,"Town of",null,1,0]
[3757100,"Robersonville",1269,1488,"Town of",null,1,0]
[3708080,"Broadway",1267,1229,"Town of",null,1,0]
[3753840,"Princeville",1254,2082,"Town of",null,1,0]
[3758440,"Rutherford College",1226,1341,"Town of",null,1,0]
[3720980,"Elm City",1218,1298,"Town of",null,1,0]
[3752140,"Pinetops",1200,1374,"Town of",null,1,0]
[3724740,"Franklinville",1197,1164,"Town of",null,1,0]
[3724900,"Fremont",1196,1255,"Town of",null,1,0]
[3707140,"Boonville",1185,1222,"Town of",null,1,0]
[3744900,"Mount Gilead",1171,1181,"Town of",null,1,0]
[3757000,"Robbins",1168,1097,"Town of",null,1,0]
[3757800,"Roseboro",1163,1191,"Town of",null,1,0]
[3703960,"Bayboro",1161,1263,"Town of",null,null,null,2]
[3705660,"Beulaville",1116,1296,"Town of",null,1,0]
[3770820,"Walnut Creek",1084,835,"Village of",null,1,0]
[3717520,"Dortches",1082,935,"Town of",null,1,0]
[3731360,"Highlands",1072,924,"Town of",null,1,0]
[3713980,"Columbus",1060,999,"Town of",null,1,0]
[3703500,"Banner Elk",1049,1028,"Town of",null,1,0]
[3739600,"Lucama",1036,1108,"Town of",null,1,0]
[3725560,"Gaston",1008,1152,"Town of",null,1,0]
[3747845,"North Topsail Beach",1005,743,"Town of",null,1,0]
[3756240,"Rhodhiss",997,1070,"Town of",null,1,0]
[3700640,"Alamance",988,951,"Village of",null,1,0]
[3708420,"Brunswick",973,1119,"Town of",null,1,0]
[3764940,"Stem",960,463,"Town of",null,1,0]
[3769840,"Vass",952,720,"Town of",null,1,0]
[3714460,"Cooleemee",940,960,"Town of",null,1,0]
[3731960,"Holden Beach",921,575,"Town of",null,1,0]
[3747240,"Norlina",920,1118,"Town of",null,1,0]
[3742700,"Middlesex",912,822,"Town of",null,1,0]
[3725540,"Garysburg",904,1057,"Town of",null,1,0]
[3744100,"Montreat",901,723,"Town of",null,1,0]
[3756440,"Rich Square",894,958,"Town of",null,1,0]
[3739880,"McAdenville",890,651,"Town of",null,1,0]
[3758140,"Rowland",885,1037,"Town of",null,1,0]
[3749380,"Oriental",880,900,"Town of",null,1,0]
[3769680,"Vanceboro",869,1005,"Town of",null,1,0]
[3748700,"Ocean Isle Beach",867,550,"Town of",null,1,0]
[3720840,"Ellerbe",864,1054,"Town of",null,1,0]
[3704960,"Belwood",857,950,"Town of",null,1,0]
[3771100,"Warrenton",851,862,"Town of",null,1,0]
[3713000,"Cleveland",846,871,"Town of",null,1,0]
[3773300,"White Lake",843,802,"Town of",null,1,0]
[3740640,"Magnolia",831,939,"Town of",null,1,0]
[3722600,"Faith",819,807,"Town of",null,1,0]
[3742100,"Maysville",818,1019,"Town of",null,1,0]
[3710120,"Candor",813,840,"Town of",null,1,0]
[3748920,"Old Fort",811,908,"Town of",null,1,0,13]
[3764580,"Star",806,876,"Town of",null,1,0]
[3728400,"Grover",802,708,"Town of",null,1,0]
[3722560,"Faison",784,961,"Town of",null,null,null,3]
[3741580,"Marshall",777,872,"Town of",null,1,0]
[3735460,"Kenansville",770,855,"Town of",null,1,0]
[3751040,"Peletier",769,644,"Town of",null,1,0]
[3702580,"Aulander",763,895,"Town of",null,1,0]
[3755460,"Red Cross",762,742,"Town of",null,1,0]
[3764560,"Stantonsburg",762,784,"Town of",null,1,0]
[3714400,"Conway",752,836,"Town of",null,1,0]
[3718060,"Duck",742,369,"Town of",null,null,null,1]
[3701000,"Alliance",733,776,"Town of",null,1,0]
[3720780,"Ellenboro",723,873,"Town of",null,1,0]
[3712580,"Chocowinity",722,820,"Town of",null,null,null,2]
[3746740,"Newland",715,698,"Town of",null,1,0]
[3751780,"Pikeville",712,678,"Town of",null,1,0]
[3722240,"Fair Bluff",709,951,"Town of",null,1,0]
[3747860,"Northwest",703,735,"City of",null,1,0]
[3710980,"Catawba",702,603,"Town of",null,1,0]
[3758020,"Rosman",701,576,"Town of",null,1,0]
[3706740,"Bogue",695,684,"Town of",null,1,0]
[3706080,"Black Creek",692,769,"Town of",null,1,0]
[3727520,"Grantsboro",692,688,"Town of",null,1,0]
[3717325,"Dobbins Heights",687,866,"Town of",null,1,0]
[3760180,"Sedalia",676,623,"Town of",null,1,0]
[3704510,"Beech Mountain",675,320,"Town of",null,1,0]
[3735890,"Kingstown",656,681,"Town of",null,1,0]
[3743580,"Misenheimer",650,728,"Village of",null,1,0]
[3770340,"Wade",638,556,"Town of",null,1,0]
[3719320,"East Bend",634,612,"Town of",null,1,0]
[3766980,"Taylortown",634,722,"Town of",null,1,0]
[3758920,"Saluda",631,713,"City of",null,1,0]
[3775080,"Winton",629,769,"Town of",null,1,0]
[3722720,"Fallston",627,607,"Town of",null,1,0]
[3773160,"Whitakers",627,744,"Town of",null,1,0]
[3770480,"Wagram",615,840,"Town of",null,1,0]
[3712780,"Clarkton",614,837,"Town of",null,1,0]
[3713940,"Columbia",610,891,"Town of",null,1,0]
[3746820,"New London",607,600,"Town of",null,1,0]
[3757020,"Robbinsville",597,620,"Town of",null,1,0]
[3725460,"Garland",595,625,"Town of",null,1,0]
[3731440,"High Shoals",595,696,"Town of",null,1,0]
[3747020,"Newton Grove",585,569,"Town of",null,1,0]
[3773760,"Whitsett",584,590,"Town of",null,1,0]
[3756340,"Richfield",582,613,"Town of",null,1,0]
[3750700,"Patterson Springs",571,622,"Town of",null,1,0]
[3737260,"Lawndale",570,606,"Town of",null,1,0]
[3703020,"Bailey",568,569,"Town of",null,1,0]
[3727780,"Greenevers",567,634,"Town of",null,1,0]
[3738680,"Littleton",559,674,"Town of",null,1,0]
[3775340,"Woodland",557,809,"Town of",null,1,0]
[3774720,"Winfall",555,594,"Town of",null,1,0]
[3729640,"Harmony",543,531,"Town of",null,1,0]
[3720700,"Elk Park",542,452,"Town of",null,1,0]
[3759980,"Seaboard",542,632,"Town of",null,1,0]
[3749600,"Ossipee",536,543,"Town of",null,1,0]
[3743440,"Minnesott Beach",530,440,"Town of",null,1,0]
[3769795,"Varnamtown",525,541,"Town of",null,1,0]
[3732840,"Hot Springs",520,560,"Town of",null,1,0]
[3706860,"Bolton",519,691,"Town of",null,1,0]
[3753160,"Polkville",516,545,"City of",null,1,0]
[3750340,"Parkton",504,436,"Town of",null,1,0]
[3757740,"Roper",485,611,"Town of",null,1,0]
[3730280,"Hayesville",461,311,"Town of",null,1,0]
[3768040,"Topsail Beach",461,368,"Town of",null,1,0]
[3742620,"Micro",458,441,"Town of",null,1,0]
[3758840,"Salemburg",457,435,"Town of",null,1,0]
[3702620,"Aurora",455,520,"Town of",null,1,0]
[3752400,"Pink Hill",451,552,"Town of",null,1,0]
[3703100,"Bakersville",450,464,"Town of",null,1,0]
[3725940,"Gibson",449,540,"Town of",null,1,0]
[3767000,"Teachey",448,376,"Town of",null,1,0]
[3708140,"Brookford",442,382,"Town of",null,1,0]
[3701420,"Ansonville",440,631,"Town of",null,1,0]
[3757700,"Ronda",438,417,"Town of",null,1,0]
[3734000,"Jackson",430,513,"Town of",null,1,0]
[3759135,"Sandyfield",430,447,"Town of",null,1,0]
[3738030,"Lewiston Woodville",426,549,"Town of",null,1,0]
[3734320,"Jamesville",424,491,"Town of",null,1,0]
[3719300,"East Arcadia",418,487,"Town of",null,1,0]
[3731920,"Hoffman",418,588,"Town of",null,1,0]
[3758620,"St. Helena",417,389,"Village of",null,1,0]
[3701640,"Arapahoe",416,556,"Town of",null,1,0]
[3732540,"Hookerton",413,409,"Town of",null,1,0]
[3739960,"Macclesfield",413,471,"Town of",null,1,0]
[3737040,"Lattimore",406,488,"Town of",null,1,0]
[3764380,"Staley",397,393,"Town of",null,1,0]
[3710960,"Caswell Beach",395,398,"Town of",null,1,0]
[3738200,"Lilesville",395,536,"Town of",null,1,0]
[3771240,"Washington Park",392,451,"Town of",null,1,0]
[3750820,"Peachland",390,437,"Town of",null,1,0]
[3762040,"Simpson",390,416,"Village of",null,1,0]
[3728240,"Grimesland",386,441,"Town of",null,1,0]
[3724440,"Fountain",385,427,"Town of",null,1,0]
[3715020,"Cove City",378,399,"Town of",null,1,0]
[3771600,"Webster",372,363,"Town of",null,1,0]
[3765530,"Sugar Mountain",371,198,"Village of",null,1,0]
[3707220,"Bostic",355,386,"Town of",null,1,0]
[3759340,"Saratoga",353,408,"Town of",null,1,0]
[3707860,"Bridgeton",349,454,"Town of",null,1,0]
[3717660,"Dover",349,401,"Town of",null,1,0]
[3758420,"Ruth",347,440,"Town of",null,1,0]
[3705340,"Bethania",344,328,"Town of",null,1,0]
[3744560,"Morven",329,511,"Town of",null,1,0]
[3708860,"Bunn",327,344,"Town of",null,1,0]
[3709760,"Calypso",327,538,"Town of",null,1,0]
[3722620,"Falcon",324,258,"Town of",null,1,0]
[3765320,"Stovall",324,418,"Town of",null,1,0]
[3760505,"Seven Devils",313,192,"Town of",null,1,0]
[3770320,"Waco",310,321,"Town of",null,1,0]
[3729120,"Hamilton",306,408,"Town of",null,1,0]
[3710760,"Casar",305,297,"Town of",null,1,0]
[3724170,"Forest Hills",303,365,"Village of",null,1,0]
[3711352,"Cedar Rock",301,300,"Village of",null,1,0]
[3702460,"Atkinson",296,299,"Town of",null,1,0]
[3744160,"Mooresboro",293,311,"Town of",null,1,0]
[3743860,"Momeyer",277,224,"Town of",null,1,0]
[3755940,"Rennert",275,383,"Town of",null,1,0]
[3762060,"Sims",275,282,"Town of",null,1,0]
[3703150,"Bald Head Island",268,158,"Village of",null,1,0]
[3731860,"Hobgood",268,348,"Town of",null,1,0]
[3753200,"Pollocksville",268,311,"Town of",null,1,0]
[3713460,"Cofield",267,413,"Village of",null,1,0]
[3718040,"Dublin",267,338,"Town of",null,1,0]
[3725680,"Gatesville",267,321,"Town of",null,1,0]
[3748060,"Oak City",266,317,"Town of",null,1,0]
[3710860,"Castalia",264,268,"Town of",null,1,0]
[3759090,"Sandy Creek",248,260,"Town of",null,1,0]
[3769720,"Vandemere",246,254,"Town of",null,1,0]
[3703840,"Bath",245,249,"Town of",null,1,0]
[3709800,"Cameron",244,285,"Town of",null,1,0]
[3750540,"Parmele",243,278,"Town of",null,1,0]
[3768320,"Trenton",238,287,"Town of",null,1,0]
[3760080,"Seagrove",235,228,"Town of",null,1,0]
[3719620,"East Laurinburg",234,300,"Town of",null,1,0]
[3726920,"Goldston",234,268,"Town of",null,1,0]
[3733460,"Indian Beach",223,112,"Town of",null,1,0]
[3713560,"Colerain",217,204,"Town of",null,1,0]
[3721960,"Eureka",214,197,"Town of",null,1,0]
[3765120,"Stonewall",214,281,"Town of",null,1,0]
[3717180,"Dillsboro",213,232,"Town of",null,1,0,14]
[3768740,"Turkey",213,292,"Town of",null,1,0]
[3715420,"Creswell",207,276,"Town of",null,1,0]
[3735360,"Kelford",203,251,"Town of",null,1,0]
[3714200,"Conetoe",198,294,"Town of",null,1,0]
[3719140,"Earl",198,260,"Town of",null,1,0]
[3770860,"Walstonburg",193,219,"Town of",null,1,0]
[3760560,"Severn",191,276,"Town of",null,1,0]
[3716240,"Danbury",189,189,"Town of",null,1,0]
[3753680,"Powellsville",189,276,"Town of",null,1,0]
[3758180,"Roxobel",187,240,"Town of",null,1,0]
[3702320,"Askewville",184,241,"Town of",null,1,0]
[3771320,"Watha",181,190,"Town of",null,1,0]
[3728920,"Halifax",170,234,"Town of",null,1,0]
[3702700,"Autryville",167,196,"Town of",null,1,0]
[3706660,"Boardman",166,157,"Town of",null,1,0]
[3750080,"Pantego",164,179,"Town of",null,1,0]
[3729680,"Harrells",160,202,"Town of",null,1,0]
[3743300,"Milton",155,166,"Town of",null,1,0]
[3739420,"Love Valley",154,90,"Town of",null,1,0]
[3722040,"Everetts",150,164,"Town of",null,1,0]
[3706820,"Bolivia",149,143,"Town of",null,1,0]
[3742480,"Mesic",144,220,"Town of",null,1,0]
[3715580,"Crossnore",143,192,"Town of",null,1,0]
[3712460,"Chimney Rock Village",140,113,"Village of",null,1,0]
[3738360,"Linden",136,130,"Town of",null,1,0]
[3736020,"Kittrell",132,467,"Town of",null,1,0]
[3711620,"Cerro Gordo",131,207,"Town of",null,1,0]
[3726740,"Godwin",128,139,"Town of",null,1,0]
[3736960,"Lansing",126,158,"Town of",null,1,0]
[3753900,"Proctorville",121,117,"Town of",null,1,0]
[3741380,"Marietta",111,175,"Town of",null,1,0]
[3740540,"Macon",110,119,"Town of",null,1,0]
[3742640,"Middleburg",101,133,"Town of",null,1,0]
[3747260,"Norman",100,138,"Town of",null,1,0]
[3727324,"Grandfather Village",95,25,"Village of",null,1,0]
[3740140,"McDonald",94,113,"Town of",null,1,0]
[3740240,"McFarlan",94,117,"Town of",null,1,0]
[3766740,"Tar Heel",90,117,"Town of",null,1,0]
[3704180,"Bear Grass",89,73,"Town of",null,1,0]
[3729720,"Harrellsville",85,106,"Town of",null,1,0]
[3739680,"Lumber Bridge",82,94,"Town of",null,1,0]
[3714060,"Como",67,91,"Town of",null,1,0]
[3737000,"Lasker",64,122,"Town of",null,1,0]
[3763720,"Speed",63,80,"Town of",null,1,0]
[3755340,"Raynham",60,72,"Town of",null,1,0]
[3749460,"Orrum",59,91,"Town of",null,1,0]
[3760540,"Seven Springs",55,110,"Town of",null,1,0]
[3730040,"Hassell",49,84,"Town of",null,1,0]
[3722640,"Falkland",47,96,"Town of",null,1,0]
[3736514,"Lake Santeetlah",38,45,"Town of",null,1,0]
[3737640,"Leggett",37,60,"Town of",null,1,0]
[3723980,"Fontana Dam",13,null,"",null,1,0]
[3716820,"Dellview",6,null,"",null,1,0]
[null,"Centerville",0,89,"Town of","Dissolved",1,0]
[3763780,"Spencer Mountain",0,37,"Town of","Suspended?",1,0]

{"sheet":"Cover Sheet","index":2,"n_rows":20,"n_cols":23,"rows_kept":20,"cut":false,"hidden":false,"merged":[[2,2,2,3],[2,5,3,5]]}
[null,"Created by : Ian Armstrong, Donald Hampton,  Adam Preslar",null,null,"Contributers: Sydney Parker, Catherine Bryant",null,null,"V1.5",null,null,null,null,null,"Division Selection & Betterment (drop down):","Div 10"]
[null,null,null,null,null,null,null,null,null,null,null,null,null,null,null,null,null,null,null,null,null,null,"Div 1"]
[null,"Betterment Selection","Click the button you want to be your betterment council meeting date",null,"Clear Betterment cell","Enter Betterment Data","Extra Review Time\n(In days)","Agenda Cutoff\n(In days)","Execution time\n(In days)",null,null,"UC Agreement Forecasting TIP",null,null,null,null,null,null,null,null,null,null,"Div 2"]
[null,"2nd & 4th Monday",null,null,null,null,7,14,14,null,null,"Utility Owners/Municipality:","Charlotte Water",null,null,null,null,null,null,null,null,null,"Div 3"]
[null,"1st & 3rd Monday",null,null,null,null,null,null,null,null,null,"Let Date:","2029-03-16",null,"Inputs",null,null,null,null,null,null,null,"Div 4"]
[null,"1st & 3rd Tuesday",null,null,null,null,null,null,null,null,null,"Advertising length (Days):",28,null,null,null,null,null,null,null,null,null,"Div 5"]
[null,"2nd Tuesday",null,null,null,null,null,null,null,null,null,"Advertisement Date:",{"$f":"'UC Agreement Forecasting'!B5","v":"2029-02-16"},null,null,null,null,null,null,null,null,null,"Div 6"]
[null,"2nd Thursday",null,null,null,null,null,null,null,null,null,"Start Exhibit Review:",{"$f":"'UC Agreement Forecasting'!B6","v":"2028-04-22"},null,null,null,null,null,null,null,null,null,"Div 7"]
[null,"1st Tuesday",null,null,null,null,null,null,null,null,null,"Start Agreement:",{"$f":"'UC Agreement Forecasting'!B7","v":"2028-06-06"},null,null,null,null,null,null,null,null,null,"Div 8"]
[null,"2nd Tuesday & Last Monday",null,null,null,null,null,null,null,null,null,"Agreement Sent to Owner:",{"$f":"'UC Agreement Forecasting'!B8","v":"2028-06-20"},null,null,null,null,null,null,null,null,null,"Div 9"]
[null,"2nd & 4th Tuesday",null,null,null,null,null,null,null,null,null,"Railroad permitting Date:",{"$f":"'UC Agreement Forecasting'!B16","v":"2028-05-14"},null,null,null,null,null,null,null,null,null,"Div 10"]
[null,"2nd Monday",null,null,null,null,null,null,null,null,null,"DEQ Permitting Date:",{"$f":"'UC Agreement Forecasting'!B9","v":"2028-09-15"},null,null,null,null,null,null,null,null,null,"Div 11"]
[null,"1st Tuesday after the 15th",null,null,null,null,null,null,null,null,null,"Owner Board Date:",{"$f":"'UC Agreement Forecasting'!B11","v":"2028-08-15"},null,null,null,null,null,null,null,null,null,"Div 12"]
[null,"1st & 3rd Thursday",null,null,null,null,null,null,null,null,null,"Agreement NCDOT board Date:",{"$f":"'UC Agreement Forecasting'!B10","v":"2028-08-03"},null,null,null,null,null,null,null,null,null,"Div 13"]
[null,"1st Monday & 3rd Tuesday",null,null,null,null,null,null,null,null,null,"Partially Executed:",{"$f":"'UC Agreement Forecasting'!B12","v":"2028-10-04"},null,null,null,null,null,null,null,null,null,"Div 14"]
[null,"2nd & 4th Wednesday",null,null,null,null,null,null,null,null,null,"Fully Executed:",{"$f":"'UC Agreement Forecasting'!B13","v":"2028-10-11"},null,null,null,null,null,null,null,null,null,"Betterment"]
[null,"3rd Tuesday",null,null,null,null,null,null,null,null,null,"Project BOT Meeting:",{"$f":"'UC Agreement Forecasting'!B14","v":"2028-12-07"}]
[null,"4th Tuesday",null,null,null,null,null,null,null,null,null,"PS&E Date:",{"$f":"'UC Agreement Forecasting'!B15","v":"2028-11-14"}]
[null,"1st Monday, 3rd Wednesday & 3rd Thursday"]
[null,"1st Thursday after the 1st Monday"]

{"sheet":"UC Agreement Forecasting","index":3,"n_rows":133,"n_cols":108,"rows_kept":133,"cut":false,"hidden":false,"merged":[[0,99,0,101],[0,102,0,104],[0,57,0,59],[0,60,0,62],[0,90,0,92],[0,84,0,86],[0,87,0,89],[0,66,0,68],[0,69,0,71],[0,72,0,74],[56,3,56,4],[0,39,0,41],[0,24,0,26],[0,15,0,17],[0,36,0,38],[0,27,0,29],[0,5,0,8],[0,9,0,11],[0,30,0,32],[8,2,9,3],[0,105,0,107],[0,12,0,14],[0,18,0,20],[0,96,0,98],[0,42,0,44],[0,45,0,47],[0,63,0,65],[0,93,0,95],[0,75,0,77],[0,78,0,80],[0,81,0,83],[0,21,0,23],[0,33,0,35],[0,48,0,50],[0,51,0,53],[0,54,0,56]]}
["UC Agreement Forecasting",null,null,null,{"$f":"IF(MONTH(B3)<=10,DATE(YEAR(B3)-1,1,1),DATE(YEAR(B3),1,1))","v":"2028-01-01"},"NCDOT (1st Wednesday)",null,null,null,"Mount Holly (2nd & 4th Monday)",null,null,"High Point (1st & 3rd Monday)",null,null,"Sanford (1st & 3rd Tuesday)",null,null,"Southern Pines (2nd Tuesday)",null,null,"Stateville(1st & 3rd Monday)",null,null," (2nd Thursday)\n",null,null,"\n(2nd & 4th Monday)",null,null,"Newton(1st Tuesday)",null,null," (2nd & 4th Monday)",null,null,"Elon(2nd Tuesday & Last Monday)",null,null,"Town of Apex (2nd & 4th Tuesdays)",null,null,"Summerfield (2nd Tuesday)",null,null,"Shelby(1st & 3rd Monday)",null,null,"Laurinburg(1st Tuesday after the 15th)",null,null,"Wilson(1st & 3rd Thursday)",null,null,"Gastonia(1st Monday & 3rd Tuesday)",null,null,"(2nd & 4th Wednesday)",null,null,"(3rd Thursday)",null,null,"Charlotte Water (3rd Tuesday)",null,null,"Archdale (4th Tuesday)",null,null,"Town of Knightdale (1st Monday, 3rd Wednesday & 3rd Thursday)",null,null,"Town of Eden (3rd Tuesday)",null,null,"Pinehurst (1st & 3rd Tuesday)",null,null,"Town of Morrisville (2nd & 4th Tuesdays)",null,null,"Town of Cary (2nd & 4th Thursday)",null,null,"Lincolnton (1st Thursday)\n",null,null,"Kings Mountain (2nd Thursday and Last Tuesday)\n",null,null,"Graham (2nd Tuesday)",null,null,"Mebane (1st Monday)",null,null,"Asheboro (1st Thursday after 1st Monday)",null,null,"2nd Monday",null,null,"3rd Monday",null,null,"1st Tuesday & 4th Wednesday"]
["Utility Owners/Municipality:",{"$f":"'Cover Sheet'!M4","v":"Charlotte Water"},null,null,null,"Agreement Meeting Cutoff","Target Cutoff","BOT Cutoff","Council Meeting","Target Cutoff","Cutoff","Council Meeting","Target Cutoff","Cutoff","Council Meeting","Target Cutoff","Cutoff","Council Meeting","Target Cutoff","Cutoff","Council Meeting","Target Cutoff","Cutoff","Council Meeting","Target Cutoff","Cutoff","Council Meeting","Target Cutoff","Cutoff","Council Meeting","Target Cutoff","Cutoff","Council Meeting","Target Cutoff","Cutoff","Council Meeting","Target Cutoff","Cutoff","Council Meeting","Target Cutoff","Cutoff","Council Meeting","Target Cutoff","Cutoff","Council Meeting","Target Cutoff","Cutoff","Council Meeting","Target Cutoff","Cutoff","Council Meeting","Target Cutoff","Cutoff","Council Meeting","Target Cutoff","Cutoff","Council Meeting","Target Cutoff","Cutoff","Council Meeting","Target Cutoff","Cutoff","Council Meeting","Target Cutoff","Cutoff","Council Meeting","Target Cutoff","Cutoff","Council Meeting","Target Cutoff","Cutoff","Council Meeting","Target Cutoff","Cutoff","Council Meeting","Target Cutoff","Cutoff","Council Meeting","Target Cutoff","Cutoff","Council Meeting","Target Cutoff","Cutoff","Council Meeting","Target Cutoff","Cutoff","Council Meeting","Target Cutoff","Cutoff","Council Meeting","Target Cutoff","Cutoff","Council Meeting","Target Cutoff","Cutoff","Council Meeting","Target Cutoff","Cutoff","Council Meeting","Target Cutoff","Cutoff","Council Meeting","Target Cutoff","Cutoff","Council Meeting","Target Cutoff","Cutoff","Council Meeting"]
["Let Date:","2029-03-16",null,null,"2028-01-06",{"$f":"IF(AND(B$8>=H2,B$8<=H3),H3,\"X\")","v":"X"},{"$f":"IF(AND(B$13>=H$2,B$13<=H$3),H$3,\"X\")","v":"X"},"2027-12-01",{"$f":"E3","v":"2028-01-06"},{"$f":"IF(AND($B$8>=K2,$B$8<=K3),K3,\"X\")","v":"X"},{"$f":"L3-INDEX($G$41:$K$133, MATCH($B$2, $G$41:$G$133, 0), 5)","v":"2027-11-21"},{"$f":"E1+14-WEEKDAY(E1+5)","v":"2028-01-10"},{"$f":"IF(AND($B$8>=N2,$B$8<=N3),N3,\"X\")","v":"X"},{"$f":"O3-INDEX($G$41:$K$133, MATCH($B$2, $G$41:$G$133, 0), 5)","v":"2027-11-14"},{"$f":"O40","v":"2028-01-03"},{"$f":"IF(AND(B$8>=Q$2,B$8<=Q$3),Q$3,\"X\")","v":"X"},{"$f":"R3-INDEX($G$41:$K$133, MATCH($B$2, $G$41:$G$133, 0), 5)","v":"2027-11-15"},{"$f":"R40","v":"2028-01-04"},{"$f":"IF(AND(B$8>=T$2,B$8<=T$3),T$3,\"X\")","v":"X"},{"$f":"U3-INDEX($G$41:$K$133, MATCH($B$2, $G$41:$G$133, 0), 5)","v":"2027-11-22"},{"$f":"U40","v":"2028-01-11"},{"$f":"IF(AND($B$8>=W2,$B$8<=W3),W3,\"X\")","v":"X"},{"$f":"X3-INDEX($G$41:$K$133, MATCH($B$2, $G$41:$G$133, 0), 5)","v":"2027-11-14"},{"$f":"X40","v":"2028-01-03"},{"$f":"IF(AND($B$8>=Z2,$B$8<=Z3),Z3,\"X\")","v":"X"},{"$f":"AA3-INDEX($G$41:$K$133, MATCH($B$2, $G$41:$G$133, 0), 5)","v":"2023-11-22"},{"$f":"AA35","v":"2024-01-11"},{"$f":"IF(AND($B$8>=AC2,$B$8<=AC3),AC3,\"X\")","v":"X"},{"$f":"AD3-INDEX($G$41:$K$133, MATCH($B$2, $G$41:$G$133, 0), 5)","v":"2027-11-21"},{"$f":"E1+14-WEEKDAY(E1+5)","v":"2028-01-10"},{"$f":"IF(AND($B$8>=AF2,$B$8<=AF3),AF3,\"X\")","v":"X"},{"$f":"AG3-INDEX($G$41:$K$133, MATCH($B$2, $G$41:$G$133, 0), 5)","v":"2027-11-15"},"2028-01-04",{"$f":"IF(AND($B$8>=AI2,$B$8<=AI3),AI3,\"X\")","v":"X"},{"$f":"AJ3-INDEX($G$41:$K$133, MATCH($B$2, $G$41:$G$133, 0), 5)","v":"2027-11-21"},{"$f":"E1+14-WEEKDAY(E1+5)","v":"2028-01-10"},{"$f":"IF(AND($B$8>=AL2,$B$8<=AL3),AL3,\"X\")","v":"X"},{"$f":"AM3-INDEX($G$41:$K$133, MATCH($B$2, $G$41:$G$133, 0), 5)","v":"2027-11-22"},{"$f":"E1+14-WEEKDAY(E1+4)","v":"2028-01-11"},{"$f":"IF(AND($B$8>=AO2,$B$8<=AO3),AO3,\"X\")","v":"X"},{"$f":"AP3-INDEX($G$41:$K$133, MATCH($B$2, $G$41:$G$133, 0), 5)","v":"2027-11-22"},{"$f":"E1+14-WEEKDAY(E1+4)","v":"2028-01-11"},{"$f":"IF(AND($B$8>=AR2,$B$8<=AR3),AR3,\"X\")","v":"X"},{"$f":"AS3-INDEX($G$41:$K$133, MATCH($B$2, $G$41:$G$133, 0), 5)","v":"2027-11-22"},{"$f":"AS40","v":"2028-01-11"},{"$f":"IF(AND($B$8>=AU2,$B$8<=AU3),AU3,\"X\")","v":"X"},{"$f":"AV3-INDEX($G$41:$K$133, MATCH($B$2, $G$41:$G$133, 0), 5)","v":"2027-11-14"},{"$f":"AV40","v":"2028-01-03"},{"$f":"IF(AND($B$8>=AX2,$B$8<=AX3),AX3,\"X\")","v":"X"},{"$f":"AY3-INDEX($G$41:$K$133, MATCH($B$2, $G$41:$G$133, 0), 5)","v":"2027-11-29"},{"$f":"AY40","v":"2028-01-18"},{"$f":"IF(AND($B$8>=BA2,$B$8<=BA3),BA3,\"X\")","v":"X"},{"$f":"BB3-INDEX($G$41:$K$133, MATCH($B$2, $G$41:$G$133, 0), 5)","v":"2027-11-17"},{"$f":"BB40","v":"2028-01-06"},{"$f":"IF(AND($B$8>=BD2,$B$8<=BD3),BD3,\"X\")","v":"X"},{"$f":"BE3-INDEX($G$41:$K$133, MATCH($B$2, $G$41:$G$133, 0), 5)","v":"2027-11-14"},{"$f":"BE40","v":"2028-01-03"},{"$f":"IF(AND($B$8>=BG2,$B$8<=BG3),BG3,\"X\")","v":"X"},{"$f":"BH3-INDEX($G$41:$K$133, MATCH($B$2, $G$41:$G$133, 0), 5)","v":"2027-11-23"},{"$f":"$E$1+14-WEEKDAY($E$1+3)","v":"2028-01-12"},{"$f":"IF(AND($B$8>=BJ2,$B$8<=BJ3),BJ3,\"X\")","v":"X"},{"$f":"BK3-INDEX($G$41:$K$133, MATCH($B$2, $G$41:$G$133, 0), 5)","v":"2027-12-01"},{"$f":"BK35","v":"2028-01-20"},{"$f":"IF(AND($B$8>=BM2,$B$8<=BM3),BM3,\"X\")","v":"X"},{"$f":"BN3-INDEX($G$41:$K$133, MATCH($B$2, $G$41:$G$133, 0), 5)","v":"2027-11-29"},{"$f":"BN40","v":"2028-01-18"},{"$f":"IF(AND($B$8>=BP2,$B$8<=BP3),BP3,\"X\")","v":"X"},{"$f":"BQ3-INDEX($G$41:$K$133, MATCH($B$2, $G$41:$G$133, 0), 5)","v":"2027-11-08"},{"$f":"BQ40","v":"2027-12-28"},{"$f":"IF(AND($B$8>=BS2,$B$8<=BS3),BS3,\"X\")","v":"X"},{"$f":"BT3-INDEX($G$41:$K$133, MATCH($B$2, $G$41:$G$133, 0), 5)","v":"2027-11-14"},{"$f":"BT55","v":"2028-01-03"},{"$f":"IF(AND($B$8>=BV2,$B$8<=BV3),BV3,\"X\")","v":"X"},{"$f":"BW3-INDEX($G$41:$K$133, MATCH($B$2, $G$41:$G$133, 0), 5)","v":"2027-11-29"},{"$f":"BW40","v":"2028-01-18"},{"$f":"IF(AND(B$8>=BY$2,B$8<=BY$3),BY$3,\"X\")","v":"X"},{"$f":"BZ3-INDEX($G$41:$K$133, MATCH($B$2, $G$41:$G$133, 0), 5)","v":"2027-11-15"},{"$f":"BZ40","v":"2028-01-04"},{"$f":"IF(AND($B$8>=CB2,$B$8<=CB3),CB3,\"X\")","v":"X"},{"$f":"CC3-INDEX($G$41:$K$133, MATCH($B$2, $G$41:$G$133, 0), 5)","v":"2027-11-22"},{"$f":"E1+14-WEEKDAY(E1+4)","v":"2028-01-11"},{"$f":"IF(AND($B$8>=CE2,$B$8<=CE3),CE3,\"X\")","v":"X"},{"$f":"CF3-INDEX($G$41:$K$133, MATCH($B$2, $G$41:$G$133, 0), 5)","v":"2027-11-24"},{"$f":"E1+14-WEEKDAY(E1+2)","v":"2028-01-13"},{"$f":"IF(AND($B$8>=CH2,$B$8<=CH3),CH3,\"X\")","v":"X"},{"$f":"CI3-INDEX($G$41:$K$133, MATCH($B$2, $G$41:$G$133, 0), 5)","v":"2027-11-17"},{"$f":"CI40","v":"2028-01-06"},{"$f":"IF(AND($B$8>=CK2,$B$8<=CK3),CK3,\"X\")","v":"X"},{"$f":"CL3-INDEX($G$41:$K$133, MATCH($B$2, $G$41:$G$133, 0), 5)","v":"2027-11-24"},{"$f":"E1+14-WEEKDAY(E1+2)","v":"2028-01-13"},{"$f":"IF(AND(B$8>=CN2,B$8<=CN3),CN3,\"X\")","v":"X"},{"$f":"CO3-INDEX($G$41:$K$133, MATCH($B$2, $G$41:$G$133, 0), 5)","v":"2027-11-22"},{"$f":"CO40","v":"2028-01-11"},{"$f":"IF(AND(B$8>=CQ$2,B$8<=CQ$3),CQ$3,\"X\")","v":"X"},{"$f":"CR3-INDEX($G$41:$K$133, MATCH($B$2, $G$41:$G$133, 0), 5)","v":"2027-11-14"},{"$f":"CR40","v":"2028-01-03"},{"$f":"IF(AND(E$8>=CT$2,E$8<=CT$3),CT$3,\"X\")","v":"X"},{"$f":"CU3-INDEX($G$41:$K$133, MATCH($B$2, $G$41:$G$133, 0), 5)","v":"2027-11-17"},{"$f":"CU40","v":"2028-01-06"},{"$f":"IF(AND(H$8>=CW$2,H$8<=CW$3),CW$3,\"X\")","v":"X"},{"$f":"CX3-INDEX($G$41:$K$133, MATCH($B$2, $G$41:$G$133, 0), 5)","v":"2027-11-21"},{"$f":"CX40","v":"2028-01-10"},{"$f":"IF(AND(K$8>=CZ$2,K$8<=CZ$3),CZ$3,\"X\")","v":"X"},{"$f":"DA3-INDEX($G$41:$K$133, MATCH($B$2, $G$41:$G$133, 0), 5)","v":"2027-11-28"},{"$f":"DA40","v":"2028-01-17"},{"$f":"IF(AND(N$8>=DC$2,N$8<=DC$3),DC$3,\"X\")","v":"X"},{"$f":"DD3-INDEX($G$41:$K$133, MATCH($B$2, $G$41:$G$133, 0), 5)","v":"2027-11-15"},{"$f":"_xlfn.LET(\n    _xlpm.m, INT((ROW()-3)/2)+1,\n    _xlpm.isTue, MOD(ROW()-3,2)=0,\n    _xlpm.startDate, DATE(YEAR($E$1), _xlpm.m, 1),\n    _xlpm.targetDay, IF(_xlpm.isTue, 3, 4),\n    _xlpm.weekOffset, IF(_xlpm.isTue, 0, 21),\n    _xlpm.startDate + MOD(_xlpm.targetDay - WEEKDAY(_xlpm.startDate), 7) + _xlpm.weekOffset\n)","v":"2028-01-04"}]
["Advertising length:",{"$f":"'Cover Sheet'!M6","v":28},null,null,"2028-02-03","X",{"$f":"IF(AND(B$13>=H$3,B$13<=H$4),H$4,\"X\")","v":"X"},"2028-01-05",{"$f":"DATE(YEAR(E3),2,7)-7","v":"2028-01-31"},"X",{"$f":"L4-INDEX($G$41:$K$133, MATCH($B$2, $G$41:$G$133, 0), 5)","v":"2027-12-05"},{"$f":"IF(DAY(L3)<15,14,IF(DAY(L3+14)<8,21,14))+L3","v":"2028-01-24"},"X",{"$f":"O4-INDEX($G$41:$K$133, MATCH($B$2, $G$41:$G$133, 0), 5)","v":"2027-11-28"},"2028-01-17",{"$f":"IF(AND(B$8>=Q$3,B$8<=Q$4),Q$4,\"X\")","v":"X"},{"$f":"R4-INDEX($G$41:$K$133, MATCH($B$2, $G$41:$G$133, 0), 5)","v":"2027-11-29"},{"$f":"R41","v":"2028-01-18"},{"$f":"IF(AND(B$8>=T$3,B$8<=T$4),T$4,\"X\")","v":"X"},{"$f":"U4-INDEX($G$41:$K$133, MATCH($B$2, $G$41:$G$133, 0), 5)","v":"2027-12-20"},"2028-02-08","X",{"$f":"X4-INDEX($G$41:$K$133, MATCH($B$2, $G$41:$G$133, 0), 5)","v":"2027-11-28"},"2028-01-17","X",{"$f":"AA4-INDEX($G$41:$K$133, MATCH($B$2, $G$41:$G$133, 0), 5)","v":"2023-12-20"},"2024-02-08",{"$f":"IF(AND($B$8>=AC3,$B$8<=AC4),AC4,\"X\")","v":"X"},{"$f":"AD4-INDEX($G$41:$K$133, MATCH($B$2, $G$41:$G$133, 0), 5)","v":"2027-12-05"},{"$f":"IF(DAY(AD3)<15,14,IF(DAY(AD3+14)<8,21,14))+AD3","v":"2028-01-24"},"X",{"$f":"AG4-INDEX($G$41:$K$133, MATCH($B$2, $G$41:$G$133, 0), 5)","v":"2027-12-13"},"2028-02-01","X",{"$f":"AJ4-INDEX($G$41:$K$133, MATCH($B$2, $G$41:$G$133, 0), 5)","v":"2027-12-05"},{"$f":"IF(DAY(AJ3)<15,14,IF(DAY(AJ3+14)<8,21,14))+AJ3","v":"2028-01-24"},"X",{"$f":"AM4-INDEX($G$41:$K$133, MATCH($B$2, $G$41:$G$133, 0), 5)","v":"2027-12-12"},{"$f":"EOMONTH(AM3,0)-WEEKDAY(EOMONTH(AM3,0),3)","v":"2028-01-31"},"X",{"$f":"AP4-INDEX($G$41:$K$133, MATCH($B$2, $G$41:$G$133, 0), 5)","v":"2027-12-06"},{"$f":"IF(DAY(AP3)<15,14,IF(DAY(AP3+14)<8,21,14))+AP3","v":"2028-01-25"},"X",{"$f":"AS4-INDEX($G$41:$K$133, MATCH($B$2, $G$41:$G$133, 0), 5)","v":"2027-12-20"},"2028-02-08","X",{"$f":"AV4-INDEX($G$41:$K$133, MATCH($B$2, $G$41:$G$133, 0), 5)","v":"2027-11-28"},{"$f":"AV41","v":"2028-01-17"},"X",{"$f":"AY4-INDEX($G$41:$K$133, MATCH($B$2, $G$41:$G$133, 0), 5)","v":"2028-01-03"},"2028-02-22","X",{"$f":"BB4-INDEX($G$41:$K$133, MATCH($B$2, $G$41:$G$133, 0), 5)","v":"2027-12-01"},"2028-01-20","X",{"$f":"BE4-INDEX($G$41:$K$133, MATCH($B$2, $G$41:$G$133, 0), 5)","v":"2027-11-29"},"2028-01-18",{"$f":"IF(AND($B$8>=BG3,$B$8<=BG4),BG4,\"X\")","v":"X"},{"$f":"BH4-INDEX($G$41:$K$133, MATCH($B$2, $G$41:$G$133, 0), 5)","v":"2027-12-07"},{"$f":"IF(DAY(BH3)<15,14,IF(DAY(BH3+14)<8,21,14))+BH3","v":"2028-01-26"},"X",{"$f":"BK4-INDEX($G$41:$K$133, MATCH($B$2, $G$41:$G$133, 0), 5)","v":"2027-12-29"},"2028-02-17","X",{"$f":"BN4-INDEX($G$41:$K$133, MATCH($B$2, $G$41:$G$133, 0), 5)","v":"2027-12-27"},"2028-02-15","X",{"$f":"BQ4-INDEX($G$41:$K$133, MATCH($B$2, $G$41:$G$133, 0), 5)","v":"2027-12-06"},"2028-01-25","X",{"$f":"BT4-INDEX($G$41:$K$133, MATCH($B$2, $G$41:$G$133, 0), 5)","v":"2027-11-30"},{"$f":"BT56","v":"2028-01-19"},"X",{"$f":"BW4-INDEX($G$41:$K$133, MATCH($B$2, $G$41:$G$133, 0), 5)","v":"2027-12-27"},"2028-02-15",{"$f":"IF(AND(B$8>=BY3,B$8<=BY4),BY4,\"X\")","v":"X"},{"$f":"BZ4-INDEX($G$41:$K$133, MATCH($B$2, $G$41:$G$133, 0), 5)","v":"2027-11-29"},"2028-01-18","X",{"$f":"CC4-INDEX($G$41:$K$133, MATCH($B$2, $G$41:$G$133, 0), 5)","v":"2027-12-06"},{"$f":"IF(DAY(CC3)<15,14,IF(DAY(CC3+14)<8,21,14))+CC3","v":"2028-01-25"},"X",{"$f":"CF4-INDEX($G$41:$K$133, MATCH($B$2, $G$41:$G$133, 0), 5)","v":"2027-12-08"},{"$f":"IF(DAY(CF3)<15,14,IF(DAY(CF3+14)<8,21,14))+CF3","v":"2028-01-27"},"X",{"$f":"CI4-INDEX($G$41:$K$133, MATCH($B$2, $G$41:$G$133, 0), 5)","v":"2027-12-15"},"2028-02-03","X",{"$f":"CL4-INDEX($G$41:$K$133, MATCH($B$2, $G$41:$G$133, 0), 5)","v":"2027-12-06"},{"$f":"EOMONTH(CL3,0)+1-WEEKDAY(EOMONTH(CL3,0)+1-3)","v":"2028-01-25"},"X",{"$f":"CO4-INDEX($G$41:$K$133, MATCH($B$2, $G$41:$G$133, 0), 5)","v":"2027-12-20"},"2028-02-08",{"$f":"IF(AND(B$8>=CQ3,B$8<=CQ4),CQ4,\"X\")","v":"X"},{"$f":"CR4-INDEX($G$41:$K$133, MATCH($B$2, $G$41:$G$133, 0), 5)","v":"2027-12-19"},"2028-02-07",{"$f":"IF(AND(E$8>=CT3,E$8<=CT4),CT4,\"X\")","v":"X"},{"$f":"CU4-INDEX($G$41:$K$133, MATCH($B$2, $G$41:$G$133, 0), 5)","v":"2027-12-22"},"2028-02-10",{"$f":"IF(AND(H$8>=CW3,H$8<=CW4),CW4,\"X\")","v":"X"},{"$f":"CX4-INDEX($G$41:$K$133, MATCH($B$2, $G$41:$G$133, 0), 5)","v":"2027-12-26"},"2028-02-14",{"$f":"IF(AND(K$8>=CZ3,K$8<=CZ4),CZ4,\"X\")","v":"X"},{"$f":"DA4-INDEX($G$41:$K$133, MATCH($B$2, $G$41:$G$133, 0), 5)","v":"2028-01-02"},"2028-02-21",{"$f":"IF(AND(N$8>=DC3,N$8<=DC4),DC4,\"X\")","v":"X"},{"$f":"DD4-INDEX($G$41:$K$133, MATCH($B$2, $G$41:$G$133, 0), 5)","v":"2027-12-07"},{"$f":"_xlfn.LET(\n    _xlpm.m, INT((ROW()-3)/2)+1,\n    _xlpm.isTue, MOD(ROW()-3,2)=0,\n    _xlpm.startDate, DATE(YEAR($E$1), _xlpm.m, 1),\n    _xlpm.targetDay, IF(_xlpm.isTue, 3, 4),\n    _xlpm.weekOffset, IF(_xlpm.isTue, 0, 21),\n    _xlpm.startDate + MOD(_xlpm.targetDay - WEEKDAY(_xlpm.startDate), 7) + _xlpm.weekOffset\n)","v":"2028-01-26"}]
["Advertisement Date:",{"$f":"$B$3-$B$4","v":"2029-02-16"},null,null,"2028-03-02","X",{"$f":"IF(AND(B$13>=H$4,B$13<=H$5),H$5,\"X\")","v":"X"},"2028-02-02",{"$f":"E5","v":"2028-03-02"},"X","2027-12-26",{"$f":"IF(DAY(L4)<15,14,IF(DAY(L4+14)<8,21,14))+L4","v":"2028-02-14"},"X","2027-12-19","2028-02-07",{"$f":"IF(AND(B$8>=Q$4,B$8<=Q$5),Q$5,\"X\")","v":"X"},"2027-12-13","2028-02-01",{"$f":"IF(AND(B$8>=T$4,B$8<=T$5),T$5,\"X\")","v":"X"},"2028-01-24","2028-03-14","X","2027-12-19","2028-02-07","X","2024-01-24","2024-03-14","X","2027-12-26",{"$f":"IF(DAY(AD4)<15,14,IF(DAY(AD4+14)<8,21,14))+AD4","v":"2028-02-14"},"X","2028-01-17","2028-03-07","X","2027-12-26",{"$f":"IF(DAY(AJ4)<15,14,IF(DAY(AJ4+14)<8,21,14))+AJ4","v":"2028-02-14"},"X","2027-12-20",{"$f":"WORKDAY.INTL(EOMONTH(AM4,0),2,\"1011111\")","v":"2028-02-08"},"X","2027-12-20",{"$f":"IF(DAY(AP4)<15,14,IF(DAY(AP4+14)<8,21,14))+AP4","v":"2028-02-08"},"X","2028-01-24","2028-03-14","X","2027-12-19","2028-02-07","X","2028-01-31","2028-03-21","X","2027-12-15","2028-02-03","X","2027-12-19","2028-02-07",{"$f":"IF(AND($B$8>=BG4,$B$8<=BG5),BG5,\"X\")","v":"X"},"2027-12-21",{"$f":"IF(DAY(BH4)<15,14,IF(DAY(BH4+14)<8,21,14))+BH4","v":"2028-02-09"},"X","2028-01-26","2028-03-16",{"$f":"IF(AND($B$8>=BM4,$B$8<=BM5),BM5,\"X\")","v":"X"},{"$f":"BN5-INDEX($G$41:$K$133, MATCH($B$2, $G$41:$G$133, 0), 5)","v":"2028-01-31"},"2028-03-21","X","2028-01-03","2028-02-22","X","2027-12-01","2028-01-20","X","2028-01-31","2028-03-21","X","2027-12-13","2028-02-01","X","2027-12-20",{"$f":"IF(DAY(CC4)<15,14,IF(DAY(CC4+14)<8,21,14))+CC4","v":"2028-02-08"},"X","2027-12-22",{"$f":"IF(DAY(CF4)<15,14,IF(DAY(CF4+14)<8,21,14))+CF4","v":"2028-02-10"},"X","2028-01-12","2028-03-02","X","2027-12-22",{"$f":"IF(DAY(CL4+9)>15,CL4+9,IF(DAY(CL4+9)<8,CL4+16,CL4+0))","v":"2028-02-10"},"X","2028-01-24","2028-03-14","X","2028-01-16","2028-03-06","X","2028-01-19","2028-03-09","X","2028-01-23","2028-03-13","X","2028-01-30","2028-03-20","X","2027-12-13","2028-02-01"]
["Start Exhibit Review:",{"$f":"$B$7-$F$42","v":"2028-04-22"},null,null,"2028-04-06","X",{"$f":"IF(AND($B$13>=H5,$B$13<=H6),H6,\"X\")","v":"X"},"2028-03-01","2028-04-06","X","2028-01-09","2028-02-28","X","2028-01-02","2028-02-21",{"$f":"IF(AND(B$8>=Q$5,B$8<=Q$6),Q$6,\"X\")","v":"X"},"2027-12-27","2028-02-15",{"$f":"IF(AND(B$8>=T$5,B$8<=T$6),T$6,\"X\")","v":"X"},"2028-02-21","2028-04-11","X","2028-01-02","2028-02-21","X","2024-02-21","2024-04-11","X","2028-01-09","2028-02-28","X","2028-02-14","2028-04-04","X","2028-01-09","2028-02-28","X","2028-01-09",{"$f":"EOMONTH(AM5,0)-WEEKDAY(EOMONTH(AM5,0),3)","v":"2028-02-28"},"X","2028-01-03","2028-02-22","X","2028-02-21","2028-04-11","X","2028-01-02","2028-02-21","X","2028-02-28","2028-04-18","X","2027-12-29","2028-02-17","X","2027-12-27","2028-02-15",{"$f":"IF(AND($B$8>=BG5,$B$8<=BG6),BG6,\"X\")","v":"X"},"2028-01-04","2028-02-23","X","2028-03-01","2028-04-20","X",{"$f":"BN6-INDEX($G$41:$K$133, MATCH($B$2, $G$41:$G$133, 0), 5)","v":"2028-02-28"},"2028-04-18","X","2028-02-07","2028-03-28","X","2027-12-19","2028-02-07","X","2028-02-28","2028-04-18","X","2027-12-27","2028-02-15","X","2028-01-03",{"$f":"IF(DAY(CC5)<15,14,IF(DAY(CC5+14)<8,21,14))+CC5","v":"2028-02-22"},"X","2028-01-05","2028-02-24","X","2028-02-16","2028-04-06","X","2028-01-10",{"$f":"EOMONTH(CL5,0)+1-WEEKDAY(EOMONTH(CL5,0)+1-3)","v":"2028-02-29"},"X","2028-02-21","2028-04-11","X","2028-02-13","2028-04-03","X","2028-02-16","2028-04-06","X","2028-02-20","2028-04-10","2028-02-27","2028-02-27","2028-04-17","X","2028-01-04","2028-02-23"]
["Start Agreement:",{"$f":"B$5 - INDEX($J$41:$J$133, MATCH($B$2, $I$41:$I$133, 0))\n       - INDEX($K$41:$K$133, MATCH($B$2, $I$41:$I$133, 0))\n       - INDEX($L$41:$L$133, MATCH($B$2, $I$41:$I$133, 0))\n       - SUM($F$43:$F$45)","v":"2028-06-06"},null,null,"2028-05-04","X",{"$f":"IF(AND(B$13>=H$6,B$13<=H$7),H$7,\"X\")","v":"X"},"2028-04-05","2028-05-04","X","2028-01-23","2028-03-13","X","2028-01-16","2028-03-06",{"$f":"IF(AND(B$8>=Q$6,B$8<=Q$7),Q$7,\"X\")","v":"X"},"2028-01-17","2028-03-07",{"$f":"IF(AND(B$8>=T$6,B$8<=T$7),T$7,\"X\")","v":"X"},"2028-03-20","2028-05-09","X","2028-01-16","2028-03-06","X","2024-03-20","2024-05-09","X","2028-01-23","2028-03-13","X","2028-03-13","2028-05-02","X","2028-01-23","2028-03-13","X","2028-01-24",{"$f":"WORKDAY.INTL(EOMONTH(AM6,0),2,\"1011111\")","v":"2028-03-14"},"X","2028-01-24","2028-03-14","X","2028-03-20","2028-05-09","X","2028-01-16","2028-03-06","X","2028-03-27","2028-05-16","X","2028-01-12","2028-03-02","X","2028-01-16","2028-03-06",{"$f":"IF(AND($B$8>=BG6,$B$8<=BG7),BG7,\"X\")","v":"X"},"2028-01-18","2028-03-08","X","2028-03-29","2028-05-18","X","2028-03-27","2028-05-16","X","2028-03-06","2028-04-25","X","2027-12-28","2028-02-16","X","2028-03-27","2028-05-16","X","2028-01-17","2028-03-07","X","2028-01-24","2028-03-14","X","2028-01-19","2028-03-09","X","2028-03-15","2028-05-04","X","2028-01-19",{"$f":"IF(DAY(CL6+9)>15,9,IF(DAY(CL6+9)<8,16,9))+CL6","v":"2028-03-09"},"X","2028-03-20","2028-05-09","X","2028-03-12","2028-05-01","X","2028-03-15","2028-05-04","X","2028-03-19","2028-05-08","X","2028-03-26","2028-05-15","X","2028-01-17","2028-03-07"]
["Agreement Sent to Owner:",{"$f":"$B$7+$F$41","v":"2028-06-20"},null,null,"2028-06-01","X",{"$f":"IF(AND(B$13>=H$7,B$13<=H$8),H$8,\"X\")","v":"X"},"2028-05-03","2028-06-01","X","2028-02-06","2028-03-27","X","2028-01-30","2028-03-20",{"$f":"IF(AND(B$8>=Q$7,B$8<=Q$8),Q$8,\"X\")","v":"X"},"2028-01-31","2028-03-21",{"$f":"IF(AND(B$8>=T$7,B$8<=T$8),T$8,\"X\")","v":"X"},"2028-04-17","2028-06-06","X","2028-01-30","2028-03-20","X","2027-11-24","2028-01-13","X","2028-02-06","2028-03-27","X","2028-04-17","2028-06-06","X","2028-02-06","2028-03-27","X","2028-02-06",{"$f":"EOMONTH(AM7,0)-WEEKDAY(EOMONTH(AM7,0),3)","v":"2028-03-27"},"X","2028-02-07","2028-03-28","X","2028-04-24","2028-06-13","X","2028-01-30","2028-03-20","X","2028-05-01","2028-06-20","X","2028-01-26","2028-03-16","X","2028-01-31","2028-03-21","X","2028-02-01","2028-03-22","X","2028-04-26","2028-06-15","X","2028-05-01","2028-06-20","X","2028-04-03","2028-05-23","X","2027-12-29","2028-02-17","X","2028-05-01","2028-06-20","X","2028-01-31","2028-03-21","X","2028-02-07","2028-03-28","X","2028-02-02","2028-03-23","X","2028-04-12","2028-06-01","X","2028-02-07","2028-03-28","X","2028-04-17","2028-06-06","X","2028-04-16","2028-06-05","X","2028-04-19","2028-06-08","X","2028-04-23","2028-06-12","X","2028-04-30","2028-06-19","2028-02-01","2028-02-01","2028-03-22"]
["DEQ Permitting Date:",{"$f":"B15-60","v":"2028-09-15"},"Water permits due sooner due to the final design requirements for submittal",null,"2028-07-06","X",{"$f":"IF(AND(B$13>=H$8,B$13<=H$9),H$9,\"X\")","v":"X"},"2028-06-07","2028-07-06",{"$f":"IF(AND($B$8>=K8,$B$8<=K9),K9,\"X\")","v":"X"},"2028-02-20","2028-04-10","X","2028-02-13","2028-04-03",{"$f":"IF(AND(B$8>=Q$8,B$8<=Q$9),Q$9,\"X\")","v":"X"},"2028-02-14","2028-04-04",{"$f":"IF(AND(B$8>=T$8,B$8<=T$9),T$9,\"X\")","v":"X"},"2028-05-29","2028-07-18","X","2028-02-13","2028-04-03","X","2027-12-22","2028-02-10","X","2028-02-20","2028-04-10","X","2028-05-15","2028-07-04","X","2028-02-20","2028-04-10","X","2028-02-21",{"$f":"WORKDAY.INTL(EOMONTH(AM8,0),2,\"1011111\")","v":"2028-04-11"},"X","2028-02-21","2028-04-11","X","2028-05-22","2028-07-11","X","2028-02-13","2028-04-03","X","2028-05-29","2028-07-18","X","2028-02-16","2028-04-06","X","2028-02-13","2028-04-03","X","2028-02-22","2028-04-12","X","2028-05-31","2028-07-20","X","2028-05-29","2028-07-18","X","2028-05-08","2028-06-27","X","2028-01-16","2028-03-06","X","2028-05-29","2028-07-18","X","2028-02-14","2028-04-04","X","2028-02-21","2028-04-11","X","2028-02-23","2028-04-13","X","2028-05-17","2028-07-06","X","2028-02-23",{"$f":"IF(DAY(CL8+9)>15,9,IF(DAY(CL8+9)<8,16,9))+CL8","v":"2028-04-13"},"X","2028-05-29","2028-07-18","X","2028-05-14","2028-07-03",{"$f":"IF(AND(E$8>=CT8,E$8<=CT9),CT9,\"X\")","v":"X"},"2028-05-17","2028-07-06","2028-05-21","2028-05-21","2028-07-10","X","2028-05-28","2028-07-17","X","2028-02-14","2028-04-04"]
["Agreement NCDOT board Date:",{"$f":"_xlfn.IFS(F$3=H$3,I$3,F$4=H$4,I$4,F$5=H$5,I$5,F$6=H$6,I$6,F$7=H$7,I$7,F$8=H$8,I$8,F$9=H$9,I$9,F$10=H$10,I$10,F$11=H$11,I$11,F$12=H$12,I$12,F$13=H$13,I$13,F$14=H$14,I$14,F$15=H$15,I$15,F$16=H$16,I$16,F$17=H$17,I$17,F18=H18,I18,F19=H19,I19,F20=H20,I20,F21=H21,I21)","v":"2028-08-03"},null,null,"2028-08-03","2028-07-05",{"$f":"IF(AND(B$13>=H$9,B$13<=H$10),H$10,\"X\")","v":"X"},"2028-07-05","2028-08-03","X","2028-03-05","2028-04-24","X","2028-02-27","2028-04-17",{"$f":"IF(AND(B$8>=Q$9,B$8<=Q$10),Q$10,\"X\")","v":"X"},"2028-02-28","2028-04-18",{"$f":"IF(AND(B$8>=T$9,B$8<=T$10),T$10,\"X\")","v":"2028-06-26"},"2028-06-26","2028-08-15","X","2028-02-27","2028-04-17","X","2028-01-19","2028-03-09","X","2028-03-05","2028-04-24","X","2028-06-12","2028-08-01","X","2028-03-05","2028-04-24","X","2028-03-05",{"$f":"EOMONTH(AM9,0)-WEEKDAY(EOMONTH(AM9,0),3)","v":"2028-04-24"},"X","2028-03-06","2028-04-25","X","2028-06-19","2028-08-08","X","2028-02-27","2028-04-17","2028-07-03","2028-07-03","2028-08-22","X","2028-03-01","2028-04-20","X","2028-02-28","2028-04-18","X","2028-03-07","2028-04-26","2028-06-28","2028-06-28","2028-08-17","2028-06-26","2028-06-26","2028-08-15","X","2028-06-05","2028-07-25","X","2028-01-25","2028-03-15","2028-06-26","2028-06-26","2028-08-15","X","2028-02-28","2028-04-18","X","2028-03-06","2028-04-25","X","2028-03-08","2028-04-27","X","2028-06-14","2028-08-03","X","2028-03-06","2028-04-25","2028-06-26","2028-06-26","2028-08-15","X","2028-06-18","2028-08-07","2028-06-21","2028-06-21","2028-08-10","X","2028-06-25","2028-08-14","X","2028-07-02","2028-08-21","X","2028-03-07","2028-04-26"]
["Owner Board Date:",{"$f":"IFERROR(INDEX(H41:H133, MATCH(B2, G41:G133, 0)), \"\")","v":"2028-08-15"},null,null,"2028-09-07","X",{"$f":"IF(AND(B$13>=H$10,B$13<=H$11),H$11,\"X\")","v":"X"},"2028-08-02","2028-09-07","X","2028-03-19","2028-05-08","X","2028-03-12","2028-05-01",{"$f":"IF(AND(B$8>=Q$10,B$8<=Q$11),Q$11,\"X\")","v":"X"},"2028-03-13","2028-05-02",{"$f":"IF(AND($B$8>=T10,$B$8<=T11),T11,\"X\")","v":"X"},"2028-07-31","2028-09-19","X","2028-03-12","2028-05-01","X","2028-02-23","2028-04-13","X","2028-03-19","2028-05-08","2028-07-17","2028-07-17","2028-09-05","X","2028-03-19","2028-05-08","X","2028-03-20",{"$f":"WORKDAY.INTL(EOMONTH(AM10,0),2,\"1011111\")","v":"2028-05-09"},"X","2028-03-20","2028-05-09","2028-07-24","2028-07-24","2028-09-12","X","2028-03-12","2028-05-01","X","2028-07-31","2028-09-19","X","2028-03-15","2028-05-04","X","2028-03-12","2028-05-01","X","2028-03-21","2028-05-10","X","2028-08-02","2028-09-21","X","2028-07-31","2028-09-19",{"$f":"IF(AND($B$8>=BP10,$B$8<=BP11),BP11,\"X\")","v":"2028-07-03"},"2028-07-03","2028-08-22","X","2028-01-26","2028-03-16","X","2028-07-31","2028-09-19","X","2028-03-13","2028-05-02","X","2028-03-20","2028-05-09","X","2028-03-22","2028-05-11","2028-07-19","2028-07-19","2028-09-07","X","2028-03-22",{"$f":"IF(DAY(CL10+9)>15,9,IF(DAY(CL10+9)<8,16,9))+CL10","v":"2028-05-11"},"X","2028-07-31","2028-09-19","2028-07-16","2028-07-16","2028-09-04","X","2028-07-19","2028-09-07","X","2028-07-23","2028-09-11","X","2028-07-30","2028-09-18","X","2028-03-13","2028-05-02"]
["Partially Executed:",{"$f":"IFERROR(B11 + INDEX(L41:L133, MATCH(B2, I41:I133, 0)), \"\")","v":"2028-10-04"},null,null,"2028-10-05","X",{"$f":"IF(AND(B$13>=H$11,B$13<=H$12),H$12,\"X\")","v":"X"},"2028-09-06","2028-10-05","X","2028-04-02","2028-05-22","X","2028-03-26","2028-05-15",{"$f":"IF(AND(B$8>=Q$11,B$8<=Q$12),Q$12,\"X\")","v":"X"},"2028-03-27","2028-05-16","X","2028-08-28","2028-10-17","X","2028-03-26","2028-05-15","X","2028-03-22","2028-05-11","X","2028-04-02","2028-05-22","X","2028-08-14","2028-10-03","X","2028-04-02","2028-05-22","X","2028-04-09",{"$f":"EOMONTH(AM11,0)-WEEKDAY(EOMONTH(AM11,0),3)","v":"2028-05-29"},"X","2028-04-03","2028-05-23","X","2028-08-21","2028-10-10","X","2028-03-26","2028-05-15","X","2028-08-28","2028-10-17","X","2028-03-29","2028-05-18","X","2028-03-27","2028-05-16","X","2028-04-04","2028-05-24","X","2028-08-30","2028-10-19","X","2028-08-28","2028-10-17","X","2028-08-07","2028-09-26",{"$f":"IF(AND($B$8>=BS11,$B$8<=BS12),BS12,\"X\")","v":"X"},"2028-02-13","2028-04-03","X","2028-08-28","2028-10-17","X","2028-03-27","2028-05-16","X","2028-04-03","2028-05-23","X","2028-04-05","2028-05-25","X","2028-08-16","2028-10-05","X","2028-04-10","2028-05-30","X","2028-08-28","2028-10-17","X","2028-08-13","2028-10-02","X","2028-08-16","2028-10-05","X","2028-08-20","2028-10-09","X","2028-08-27","2028-10-16","X","2028-04-04","2028-05-24"]
["Fully Executed:",{"$f":"$B$12+$F$45","v":"2028-10-11"},"<---Should be at/before PS&E Date",null,"2028-11-02","X",{"$f":"IF(AND(B$13>=H$12,B$13<=H$13),H$13,\"X\")","v":"X"},"2028-10-04","2028-11-02","X","2028-04-23","2028-06-12","X","2028-04-16","2028-06-05",{"$f":"IF(AND(B$8>=Q$12,B$8<=Q$13),Q$13,\"X\")","v":"X"},"2028-04-17","2028-06-06","X","2028-09-18","2028-11-07","X","2028-04-16","2028-06-05","X","2028-04-26","2028-06-15","X","2028-04-23","2028-06-12","X","2028-09-18","2028-11-07","X","2028-04-23","2028-06-12","X","2028-04-24",{"$f":"WORKDAY.INTL(EOMONTH(AM12,0),2,\"1011111\")","v":"2028-06-13"},"X","2028-04-24","2028-06-13","X","2028-09-25","2028-11-14","X","2028-04-16","2028-06-05","X","2028-10-02","2028-11-21","X","2028-04-12","2028-06-01","X","2028-04-16","2028-06-05","X","2028-04-25","2028-06-14","X","2028-09-27","2028-11-16","X","2028-10-02","2028-11-21","X","2028-09-04","2028-10-24",{"$f":"IF(AND($B$8>=BS12,$B$8<=BS13),BS13,\"X\")","v":"X"},"2028-02-29","2028-04-19","X","2028-10-02","2028-11-21","X","2028-04-17","2028-06-06","X","2028-04-24","2028-06-13","X","2028-04-19","2028-06-08","X","2028-09-13","2028-11-02","X","2028-04-19",{"$f":"IF(DAY(CL12+9)>15,9,IF(DAY(CL12+9)<8,16,9))+CL12","v":"2028-06-08"},"X","2028-09-18","2028-11-07","X","2028-09-17","2028-11-06","X","2028-09-20","2028-11-09","X","2028-09-24","2028-11-13","X","2028-10-01","2028-11-20","X","2028-04-17","2028-06-06"]
["Project BOT Meeting:",{"$f":"_xlfn.IFS(G$3=H$3,I$3,G$4=H$4,I$4,G$5=H$5,I$5,G$6=H$6,I$6,G$7=H$7,I$7,G$8=H$8,I$8,G$9=H$9,I$9,G$10=H$10,I$10,G$11=H$11,I$11,G$12=H$12,I$12,G$13=H$13,I$13,G$14=H$14,I$14,G$15=H$15,I$15,G$16=H$16,I$16,G$17=H$17,I$17,G18=H18,I18,G19=H19,I19,G20=H20,I20,G21=H21,I21,G22=H22,I22,G23=H23,I23,G24=H24,I24,G25=H25,I25)","v":"2028-12-07"},null,null,"2028-12-07","X",{"$f":"IF(AND(B$13>=H$13,B$13<=H$14),H$14,\"X\")","v":"2028-11-01"},"2028-11-01","2028-12-07","X","2028-05-07","2028-06-26","X","2028-04-30","2028-06-19",{"$f":"IF(AND(B$8>=Q$13,B$8<=Q$14),Q$14,\"X\")","v":"X"},"2028-05-01","2028-06-20","X","2028-10-30","2028-12-19","X","2028-04-30","2028-06-19","X","2028-05-24","2028-07-13","X","2028-05-07","2028-06-26","X","2028-10-16","2028-12-05","X","2028-05-07","2028-06-26","X","2028-05-07",{"$f":"EOMONTH(AM13,0)-WEEKDAY(EOMONTH(AM13,0),3)","v":"2028-06-26"},"X","2028-05-08","2028-06-27","X","2028-10-23","2028-12-12","X","2028-04-30","2028-06-19","X","2028-10-30","2028-12-19","X","2028-04-26","2028-06-15","X","2028-05-01","2028-06-20","X","2028-05-09","2028-06-28","X","2028-11-01","2028-12-21","X","2028-10-30","2028-12-19","X","2028-10-09","2028-11-28",{"$f":"IF(AND($B$8>=BS13,$B$8<=BS14),BS14,\"X\")","v":"X"},"2028-03-01","2028-04-20","X","2028-10-30","2028-12-19","X","2028-05-01","2028-06-20","X","2028-05-08","2028-06-27","X","2028-05-03","2028-06-22","X","2028-10-18","2028-12-07","X","2028-05-08","2028-06-27","X","2028-10-30","2028-12-19","X","2028-10-15","2028-12-04","X","2028-10-18","2028-12-07","X","2028-10-22","2028-12-11","X","2028-10-29","2028-12-18","X","2028-05-09","2028-06-28"]
["PS&E:",{"$f":"_xlfn.LET( _xlpm.baseDate, INDEX(A21:A45, MATCH(MAX(IF(B21:B45 <= B3, B21:B45)), B21:B45, 0)), _xlpm.d, IF(B4 = 56, _xlpm.baseDate - 30, _xlpm.baseDate), _xlpm.d + MOD(2 - WEEKDAY(_xlpm.d,2), 7) )","v":"2028-11-14"},null,null,"2029-01-04","X",{"$f":"IF(AND(B$13>=H$14,B$13<=H$15),H$15,\"X\")","v":"X"},"2028-12-06","2029-01-04","X","2028-05-21","2028-07-10","X","2028-05-14","2028-07-03",{"$f":"IF(AND(B$8>=Q$14,B$8<=Q$15),Q$15,\"X\")","v":"X"},"2028-05-15","2028-07-04","X","2028-11-20","2029-01-09","X","2028-05-14","2028-07-03","2028-06-21","2028-06-21","2028-08-10","X","2028-05-21","2028-07-10","X","2028-11-13","2029-01-02","X","2028-05-21","2028-07-10","X","2028-05-22",{"$f":"WORKDAY.INTL(EOMONTH(AM14,0),2,\"1011111\")","v":"2028-07-11"},"X","2028-05-22","2028-07-11","X","2028-11-20","2029-01-09","X","2028-05-14","2028-07-03","X","2028-11-27","2029-01-16","X","2028-05-17","2028-07-06","X","2028-05-14","2028-07-03","X","2028-05-23","2028-07-12","X","2028-11-29","2029-01-18","X","2028-11-27","2029-01-16","X","2028-11-06","2028-12-26",{"$f":"IF(AND($B$8>=BS14,$B$8<=BS15),BS15,\"X\")","v":"X"},"2028-03-12","2028-05-01","X","2028-11-27","2029-01-16","X","2028-05-15","2028-07-04","X","2028-05-22","2028-07-11","X","2028-05-24","2028-07-13","X","2028-11-15","2029-01-04","X","2028-05-24",{"$f":"IF(DAY(CL14+9)>15,9,IF(DAY(CL14+9)<8,16,9))+CL14","v":"2028-07-13"},"X","2028-11-20","2029-01-09","X","2028-11-12","2029-01-01","X","2028-11-15","2029-01-04","X","2028-11-19","2029-01-08","X","2028-11-26","2029-01-15","X","2028-05-15","2028-07-04"]
["Railroad permitting date:",{"$f":"EDATE(B15,-6)","v":"2028-05-14"},null,null,"2029-02-01","X",{"$f":"IF(AND(B$13>=H$15,B$13<=H$16),H$16,\"X\")","v":"X"},"2029-01-03",{"$f":"DATE(YEAR(E15),2,7)-7","v":"2029-01-31"},"X","2028-06-04","2028-07-24","X","2028-05-28","2028-07-17",{"$f":"IF(AND(B$8>=Q$15,B$8<=Q$16),Q$16,\"X\")","v":"X"},"2028-05-29","2028-07-18","X","2028-12-25","2029-02-13","X","2028-05-28","2028-07-17","X","2028-07-26","2028-09-14","X","2028-06-04","2028-07-24","X","2028-12-18","2029-02-06","X","2028-06-04","2028-07-24","X","2028-06-11",{"$f":"EOMONTH(AM15,0)-WEEKDAY(EOMONTH(AM15,0),3)","v":"2028-07-31"},"X","2028-06-05","2028-07-25","X","2028-12-25","2029-02-13","X","2028-05-28","2028-07-17","X","2029-01-01","2029-02-20","X","2028-05-31","2028-07-20","X","2028-05-29","2028-07-18","X","2028-06-06","2028-07-26","X","2028-12-27","2029-02-15","X","2029-01-01","2029-02-20","X","2028-12-04","2029-01-23","X","2028-03-28","2028-05-17","X","2029-01-01","2029-02-20","X","2028-05-29","2028-07-18","X","2028-06-05","2028-07-25","X","2028-06-07",{"$f":"IF(DAY(CF15)<15,14,IF(DAY(CF15+14)<8,21,14))+CF15","v":"2028-07-27"},"X","2028-12-13","2029-02-01","X","2028-06-05","2028-07-25","X","2028-12-25","2029-02-13","X","2028-12-17","2029-02-05","X","2028-12-20","2029-02-08","X",-50,"00:00:00","X","2028-12-31","2029-02-19","X","2028-06-06","2028-07-26"]
[null,null,null,null,"2029-03-01",{"$f":"IF(AND(B$8>=H16,B$8<=H17),H17,\"X\")","v":"X"},{"$f":"IF(AND(B$13>=H$16,B$13<=H$17),H$17,\"X\")","v":"X"},"2029-02-07",{"$f":"E17","v":"2029-03-01"},{"$f":"IF(AND($B$8>=K16,$B$8<=K17),K17,\"X\")","v":"2028-06-25"},"2028-06-25","2028-08-14","X","2028-06-18","2028-08-07",{"$f":"IF(AND(B$8>=Q$16,B$8<=Q$17),Q$17,\"X\")","v":"X"},"2028-06-12","2028-08-01","X","2029-01-22","2029-03-13","X","2028-06-18","2028-08-07","X","2028-08-23","2028-10-12","2028-06-25","2028-06-25","2028-08-14","X","2029-01-15","2029-03-06","2028-06-25","2028-06-25","2028-08-14","X","2028-06-19",{"$f":"WORKDAY.INTL(EOMONTH(AM16,0),2,\"1011111\")","v":"2028-08-08"},"X","2028-06-19","2028-08-08","X","2029-01-22","2029-03-13","X","2028-06-18","2028-08-07","X","2029-01-29","2029-03-20","X","2028-06-14","2028-08-03","X","2028-06-18","2028-08-07","2028-06-20","2028-06-20","2028-08-09","X","2029-01-24","2029-03-15","X","2029-01-29","2029-03-20","X","2029-01-08","2029-02-27","X","2028-03-29","2028-05-18","X","2029-01-29","2029-03-20","X","2028-06-12","2028-08-01","X","2028-06-19","2028-08-08","2028-06-21","2028-06-21","2028-08-10","X","2029-01-10","2029-03-01","2028-06-21","2028-06-21",{"$f":"IF(DAY(CL16+9)>15,9,IF(DAY(CL16+9)<8,16,9))+CL16","v":"2028-08-10"},"X","2029-01-22","2029-03-13","X","2029-01-14","2029-03-05","X","2029-01-17","2029-03-08","2029-01-21","2029-01-21","2029-03-12","X","2029-01-28","2029-03-19","X","2028-06-12","2028-08-01"]
[null,null,null,null,"2029-04-05","X",{"$f":"IF(AND(B$13>=H$17,B$13<=H$18),H$18,\"X\")","v":"X"},"2029-03-07",{"$f":"E18","v":"2029-04-05"},"X","2028-07-09","2028-08-28","2028-07-02","2028-07-02","2028-08-21",{"$f":"IF(AND(B$8>=Q$17,B$8<=Q$18),Q$18,\"X\")","v":"2028-06-26"},"2028-06-26","2028-08-15","X","2029-02-19","2029-04-10","2028-07-02","2028-07-02","2028-08-21","X","2028-09-20","2028-11-09","X","2028-07-09","2028-08-28","X","2029-02-12","2029-04-03","X","2028-07-09","2028-08-28","2028-07-09","2028-07-09",{"$f":"EOMONTH(AM17,0)-WEEKDAY(EOMONTH(AM17,0),3)","v":"2028-08-28"},"2028-07-03","2028-07-03","2028-08-22","X","2029-02-19","2029-04-10","2028-07-02","2028-07-02","2028-08-21","X","2029-02-26","2029-04-17","2028-06-28","2028-06-28","2028-08-17","2028-06-26","2028-06-26","2028-08-15","2028-07-04","2028-07-04","2028-08-23","X","2029-02-28","2029-04-19","X","2029-02-26","2029-04-17","X","2029-02-05","2029-03-27","X","2028-04-16","2028-06-05","X","2029-02-26","2029-04-17","2028-06-26","2028-06-26","2028-08-15","2028-07-03","2028-07-03","2028-08-22","X","2028-07-05","2028-08-24","X","2029-02-14","2029-04-05","X","2028-07-10","2028-08-29","X","2029-02-19","2029-04-10","X","2029-02-11","2029-04-02","X","2029-02-14","2029-04-05","X","2029-02-18","2029-04-09","X","2029-02-25","2029-04-16","X","2028-07-04","2028-08-23"]
[null,null,null,null,"2029-05-03","X",{"$f":"IF(AND(B$13>=H$18,B$13<=H$19),H$19,\"X\")","v":"X"},"2029-04-04",{"$f":"E19","v":"2029-05-03"},"X","2028-07-23","2028-09-11","X","2028-07-16","2028-09-04",{"$f":"IF(AND(B$8>=Q$18,B$8<=Q$19),Q$19,\"X\")","v":"X"},"2028-07-17","2028-09-05","X","2029-03-19","2029-05-08","X","2028-07-16","2028-09-04","X","2028-10-25","2028-12-14","X","2028-07-23","2028-09-11",{"$f":"IF(AND($B$8>=AF18,$B$8<=AF19),AF19,\"X\")","v":"X"},"2029-03-12","2029-05-01","X","2028-07-23","2028-09-11","X","2028-07-24",{"$f":"WORKDAY.INTL(EOMONTH(AM18,0),2,\"1011111\")","v":"2028-09-12"},"X","2028-07-24","2028-09-12","X","2029-03-19","2029-05-08","X","2028-07-16","2028-09-04","X","2029-04-02","2029-05-22","X","2028-07-19","2028-09-07","X","2028-07-16","2028-09-04","X","2028-07-25","2028-09-13","X","2029-03-28","2029-05-17","X","2029-03-26","2029-05-15","X","2029-03-05","2029-04-24","X","2028-05-02","2028-06-21","X","2029-03-26","2029-05-15","X","2028-07-17","2028-09-05","X","2028-07-24","2028-09-12","X","2028-07-26","2028-09-14","X","2029-03-14","2029-05-03","X","2028-07-26",{"$f":"IF(DAY(CL18+9)>15,9,IF(DAY(CL18+9)<8,16,9))+CL18","v":"2028-09-14"},"X","2029-03-19","2029-05-08","X","2029-03-18","2029-05-07","X","2029-03-21","2029-05-10","X","2029-03-25","2029-05-14","X","2029-04-01","2029-05-21","X","2028-07-17","2028-09-05"]
["PS&E","Central Letting dates","2028-01-18",{"$f":"IF(DAY(OFFSET(INDIRECT(ADDRESS(ROW(),COLUMN())),0,-1))<15,C20+7,IF(DAY(OFFSET(INDIRECT(ADDRESS(ROW(),COLUMN())),0,-1))>21,C20-7,C20+0))","v":"2028-01-18"},"2029-06-07","X",{"$f":"IF(AND(B$13>=H$19,B$13<=H$20),H$20,\"X\")","v":"X"},"2029-05-02",{"$f":"E20","v":"2029-06-07"},"X","2028-08-06","2028-09-25","X","2028-07-30","2028-09-18",{"$f":"IF(AND(B$8>=Q$19,B$8<=Q$20),Q$20,\"X\")","v":"X"},"2028-07-31","2028-09-19","X","2029-04-23","2029-06-12","X","2028-07-30","2028-09-18","X","2028-11-22","2029-01-11","X","2028-08-06","2028-09-25","X","2029-04-16","2029-06-05","X","2028-08-06","2028-09-25","X","2028-08-06",{"$f":"EOMONTH(AM19,0)-WEEKDAY(EOMONTH(AM19,0),3)","v":"2028-09-25"},"X","2028-08-07","2028-09-26","X","2029-04-23","2029-06-12","X","2028-07-30","2028-09-18","X","2029-04-30","2029-06-19","X","2028-08-02","2028-09-21","X","2028-07-31","2028-09-19","X","2028-08-08","2028-09-27","X","2029-05-02","2029-06-21","X","2029-04-30","2029-06-19","X","2029-04-02","2029-05-22","X","2028-04-26","2028-06-15","X","2029-04-30","2029-06-19","X","2028-07-31","2028-09-19","X","2028-08-07","2028-09-26","X","2028-08-09","2028-09-28","X","2029-04-18","2029-06-07","X","2028-08-07","2028-09-26","X","2029-04-23","2029-06-12","X","2029-04-15","2029-06-04","X","2029-04-18","2029-06-07","X","2029-04-22","2029-06-11","X","2029-04-29","2029-06-18","X","2028-08-08","2028-09-27"]
["2027-10-11",{"$f":"D20","v":"2028-01-18"},"2028-02-22",{"$f":"IF(DAY(OFFSET(INDIRECT(ADDRESS(ROW(),COLUMN())),0,-1))<15,C21+7,IF(DAY(OFFSET(INDIRECT(ADDRESS(ROW(),COLUMN())),0,-1))>21,C21-7,C21+0))","v":"2028-02-15"},"2029-07-05","X",{"$f":"IF(AND(B$13>=H20,B$13<=H21),H21,\"X\")","v":"X"},"2029-06-06",{"$f":"E21","v":"2029-07-05"},"X",{"$f":"L21-INDEX($G$41:$K$133, MATCH($B$2, $G$41:$G$133, 0), 5)","v":"2028-08-20"},"2028-10-09","X","2028-08-13","2028-10-02",{"$f":"IF(AND(B$8>=Q$20,B$8<=Q$21),Q$21,\"X\")","v":"X"},"2028-08-14","2028-10-03","X","2029-05-21","2029-07-10","X","2028-08-13","2028-10-02","X","2028-12-20","2029-02-08","X","2028-08-20","2028-10-09","X","2029-05-14","2029-07-03","X","2028-08-20","2028-10-09","X","2028-08-21",{"$f":"WORKDAY.INTL(EOMONTH(AM20,0),2,\"1011111\")","v":"2028-10-10"},"X","2028-08-21","2028-10-10","X","2029-05-21","2029-07-10","X","2028-08-13","2028-10-02","X","2029-05-28","2029-07-17","X","2028-08-16","2028-10-05","X","2028-08-13","2028-10-02","X","2028-08-22","2028-10-11","X","2029-05-30","2029-07-19","X","2029-05-28","2029-07-17","X","2029-05-07","2029-06-26","X","2028-05-14","2028-07-03","X","2029-05-28","2029-07-17","X","2028-08-14","2028-10-03","X","2028-08-21","2028-10-10","X","2028-08-23","2028-10-12","X","2029-05-16","2029-07-05","X","2028-08-23",{"$f":"IF(DAY(CL20+9)>15,9,IF(DAY(CL20+9)<8,16,9))+CL20","v":"2028-10-12"},"X","2029-05-21","2029-07-10","X","2029-05-13","2029-07-02","X","2029-05-16","2029-07-05","X","2029-05-20","2029-07-09","X","2029-05-27","2029-07-16","X","2028-08-14","2028-10-03"]
["2027-11-15","2028-02-15","2028-03-21",{"$f":"IF(DAY(OFFSET(INDIRECT(ADDRESS(ROW(),COLUMN())),0,-1))<15,C22+7,IF(DAY(OFFSET(INDIRECT(ADDRESS(ROW(),COLUMN())),0,-1))>21,C22-7,C22+0))","v":"2028-03-21"},"2029-08-02",{"$f":"IF(AND(B$8>=H21,B$8<=H22),H22,\"X\")","v":"X"},{"$f":"IF(AND(B$13>=H21,B$13<=H22),H22,\"X\")","v":"X"},"2029-07-04",{"$f":"E22","v":"2029-08-02"},"X","2028-09-03","2028-10-23","X","2028-08-27","2028-10-16",{"$f":"IF(AND(B$8>=Q$21,B$8<=Q$22),Q$22,\"X\")","v":"X"},"2028-08-28","2028-10-17","X","2029-06-25","2029-08-14","X","2028-08-27","2028-10-16","X","2029-01-17","2029-03-08","X","2028-09-03","2028-10-23","X","2029-06-18","2029-08-07","X","2028-09-03","2028-10-23","X","2028-09-10",{"$f":"EOMONTH(AM21,0)-WEEKDAY(EOMONTH(AM21,0),3)","v":"2028-10-30"},"X","2028-09-04","2028-10-24","X","2029-06-25","2029-08-14","X","2028-08-27","2028-10-16","X","2029-07-02","2029-08-21","X","2028-08-30","2028-10-19","X","2028-08-28","2028-10-17","X","2028-09-05","2028-10-25","X","2029-06-27","2029-08-16","X","2029-07-02","2029-08-21","X","2029-06-04","2029-07-24",{"$f":"IF(AND($B$8>=BS21,$B$8<=BS22),BS22,\"X\")","v":"X"},"2028-05-30","2028-07-19","X","2029-07-02","2029-08-21","X","2028-08-28","2028-10-17","X","2028-09-04","2028-10-24","X","2028-09-06","2028-10-26","X","2029-06-13","2029-08-02","X","2028-09-11","2028-10-31","X","2029-06-25","2029-08-14","X","2029-06-17","2029-08-06","X","2029-06-20","2029-08-09","X","2029-06-24","2029-08-13","X","2029-07-01","2029-08-20","X","2028-09-05","2028-10-25"]
["2027-12-13","2028-03-21","2028-04-18",{"$f":"IF(DAY(OFFSET(INDIRECT(ADDRESS(ROW(),COLUMN())),0,-1))<15,C23+7,IF(DAY(OFFSET(INDIRECT(ADDRESS(ROW(),COLUMN())),0,-1))>21,C23-7,C23+0))","v":"2028-04-18"},"2029-09-06",{"$f":"IF(AND(B$8>=H22,B$8<=H23),H23,\"X\")","v":"X"},"X","2029-08-01","2029-09-06","X","2028-09-24","2028-11-13","X","2028-09-17","2028-11-06",{"$f":"IF(AND(B$8>=Q$22,B$8<=Q$23),Q$23,\"X\")","v":"X"},"2028-09-18","2028-11-07","X","2029-07-23","2029-09-11","X","2028-09-17","2028-11-06","X","2029-02-21","2029-04-12","X","2028-09-24","2028-11-13","X","2029-07-16","2029-09-04","X","2028-09-24","2028-11-13","X","2028-09-25",{"$f":"WORKDAY.INTL(EOMONTH(AM22,0),2,\"1011111\")","v":"2028-11-14"},"X","2028-09-25","2028-11-14","X","2029-07-23","2029-09-11","X","2028-09-17","2028-11-06","X","2029-07-30","2029-09-18","X","2028-09-13","2028-11-02","X","2028-09-17","2028-11-06","X","2028-09-19","2028-11-08","X","2029-08-01","2029-09-20","X","2029-07-30","2029-09-18","X","2029-07-09","2029-08-28","X","2028-05-31","2028-07-20","X","2029-07-30","2029-09-18","X","2028-09-18","2028-11-07","X","2028-09-25","2028-11-14","X","2028-09-20","2028-11-09","X","2029-07-18","2029-09-06","X","2028-09-20",{"$f":"IF(DAY(CL22+9)>15,9,IF(DAY(CL22+9)<8,16,9))+CL22","v":"2028-11-09"},"X","2029-07-23","2029-09-11","X","2029-07-15","2029-09-03","X","2029-07-18","2029-09-06","X","2029-07-22","2029-09-10","X","2029-07-29","2029-09-17","X","2028-09-18","2028-11-07"]
["2028-01-10","2028-04-18","2028-05-16",{"$f":"IF(DAY(OFFSET(INDIRECT(ADDRESS(ROW(),COLUMN())),0,-1))<15,C24+7,IF(DAY(OFFSET(INDIRECT(ADDRESS(ROW(),COLUMN())),0,-1))>21,C24-7,C24+0))","v":"2028-05-16"},"2029-10-04","X","X","2029-09-05","2029-10-04","X","2028-10-08","2028-11-27","X","2028-10-01","2028-11-20",{"$f":"IF(AND(B$8>=Q$23,B$8<=Q$24),Q$24,\"X\")","v":"X"},"2028-10-02","2028-11-21","X","2029-08-20","2029-10-09","X","2028-10-01","2028-11-20","X","2029-03-21","2029-05-10","X","2028-10-08","2028-11-27","X","2029-08-13","2029-10-02","X","2028-10-08","2028-11-27","X","2028-10-08",{"$f":"EOMONTH(AM23,0)-WEEKDAY(EOMONTH(AM23,0),3)","v":"2028-11-27"},"X","2028-10-09","2028-11-28","X","2029-08-20","2029-10-09","X","2028-10-01","2028-11-20","X","2029-08-27","2029-10-16","X","2028-09-27","2028-11-16","X","2028-10-02","2028-11-21","X","2028-10-03","2028-11-22","X","2029-08-29","2029-10-18","X","2029-08-27","2029-10-16","X","2029-08-06","2029-09-25","X","2028-06-18","2028-08-07","X","2029-08-27","2029-10-16","X","2028-10-02","2028-11-21","X","2028-10-09","2028-11-28","X","2028-10-04","2028-11-23","X","2029-08-15","2029-10-04","X","2028-10-09","2028-11-28","X","2029-08-20","2029-10-09","X","2029-08-12","2029-10-01","X","2029-08-15","2029-10-04","X","2029-08-19","2029-10-08","X","2029-08-26","2029-10-15","X","2028-10-03","2028-11-22"]
["2028-02-07","2028-05-16","2028-06-20",{"$f":"IF(DAY(OFFSET(INDIRECT(ADDRESS(ROW(),COLUMN())),0,-1))<15,C25+7,IF(DAY(OFFSET(INDIRECT(ADDRESS(ROW(),COLUMN())),0,-1))>21,C25-7,C25+0))","v":"2028-06-20"},"2029-11-01","X","X","2029-10-03","2029-11-01","X","2028-10-22","2028-12-11","X","2028-10-15","2028-12-04",{"$f":"IF(AND(B$8>=Q$24,B$8<=Q$25),Q$25,\"X\")","v":"X"},"2028-10-16","2028-12-05","X","2029-09-24","2029-11-13","X","2028-10-15","2028-12-04","X","2029-04-25","2029-06-14","X","2028-10-22","2028-12-11","X","2029-09-17","2029-11-06","X","2028-10-22","2028-12-11","X","2028-10-23",{"$f":"WORKDAY.INTL(EOMONTH(AM24,0),2,\"1011111\")","v":"2028-12-12"},"X","2028-10-23","2028-12-12","X","2029-09-24","2029-11-13","X","2028-10-15","2028-12-04","X","2029-10-01","2029-11-20","X","2028-10-18","2028-12-07","X","2028-10-15","2028-12-04","X","2028-10-24","2028-12-13","X","2029-09-26","2029-11-15","X","2029-10-01","2029-11-20","X","2029-09-03","2029-10-23","2028-06-27","2028-06-27","2028-08-16","X","2029-10-01","2029-11-20","X","2028-10-16","2028-12-05","X","2028-10-23","2028-12-12","X","2028-10-25","2028-12-14","X","2029-09-12","2029-11-01","X","2028-10-25",{"$f":"IF(DAY(CL24+9)>15,9,IF(DAY(CL24+9)<8,16,9))+CL24","v":"2028-12-14"},"X","2029-09-24","2029-11-13","X","2029-09-16","2029-11-05","X","2029-09-19","2029-11-08","X","2029-09-23","2029-11-12","X","2029-09-30","2029-11-19","X","2028-10-16","2028-12-05"]
["2028-03-13","2028-06-20","2028-07-18",{"$f":"IF(DAY(OFFSET(INDIRECT(ADDRESS(ROW(),COLUMN())),0,-1))<15,C26+7,IF(DAY(OFFSET(INDIRECT(ADDRESS(ROW(),COLUMN())),0,-1))>21,C26-7,C26+0))","v":"2028-07-18"},null,null,null,null,null,"X","2028-11-05",{"$f":"IF(DAY(L25)<15,14,IF(DAY(L25+14)<8,21,14))+L25","v":"2028-12-25"},"X","2028-10-29","2028-12-18",{"$f":"IF(AND(B$8>=Q$25,B$8<=Q$26),Q$26,\"X\")","v":"X"},"2028-10-30","2028-12-19","X","2029-10-22","2029-12-11","X","2028-10-29","2028-12-18","X","2029-05-23","2029-07-12","X","2028-11-05","2028-12-25","X","2029-10-15","2029-12-04","X","2028-11-05","2028-12-25","X","2028-11-05",{"$f":"EOMONTH(AM25,0)-WEEKDAY(EOMONTH(AM25,0),3)","v":"2028-12-25"},"X","2028-11-06","2028-12-26","X","2029-10-22","2029-12-11","X","2028-10-29","2028-12-18","X","2029-10-29","2029-12-18","X","2028-11-01","2028-12-21","X","2028-10-30","2028-12-19","X","2028-11-07","2028-12-27","X","2029-10-31","2029-12-20","X","2029-10-29","2029-12-18","X","2029-10-08","2029-11-27","X","2028-06-28","2028-08-17","X","2029-10-29","2029-12-18","X","2028-10-30","2028-12-19","X","2028-11-06","2028-12-26","X","2028-11-08","2028-12-28","X","2029-10-17","2029-12-06","X","2028-11-06","2028-12-26","X","2029-10-22","2029-12-11","X","2029-10-14","2029-12-03","X","2029-10-17","2029-12-06","X","2029-10-21","2029-12-10","X","2029-10-28","2029-12-17","X","2028-11-07","2028-12-27"]
["2028-04-10","2028-07-18","2028-08-22",{"$f":"IF(DAY(OFFSET(INDIRECT(ADDRESS(ROW(),COLUMN())),0,-1))<15,C27+7,IF(DAY(OFFSET(INDIRECT(ADDRESS(ROW(),COLUMN())),0,-1))>21,C27-7,C27+0))","v":"2028-08-15"},null,null,null,null,null,"X","2028-11-19",{"$f":"IF(DAY(L26)<15,14,IF(DAY(L26+14)<8,21,14))+L26","v":"2029-01-08"},"X","2028-11-12","2029-01-01",{"$f":"IF(AND(B$8>=Q$26,B$8<=Q$27),Q$27,\"X\")","v":"X"},"2028-11-13","2029-01-02","X","2029-11-19","2030-01-08","X","2028-11-12","2029-01-01","X","2029-06-20","2029-08-09","X","2028-11-19","2029-01-08","X","2029-11-12","2030-01-01","X","2028-11-19","2029-01-08","X","2028-11-20",{"$f":"WORKDAY.INTL(EOMONTH(AM26,0),2,\"1011111\")","v":"2029-01-09"},"X","2028-11-20","2029-01-09","X","2029-11-19","2030-01-08","X","2028-11-12","2029-01-01","X","2029-12-03","2030-01-22","X","2028-11-15","2029-01-04","X","2028-11-12","2029-01-01","X","2028-11-21","2029-01-10","X","2029-11-28","2030-01-17","X","2029-11-26","2030-01-15","X","2029-11-05","2029-12-25","X","2028-07-16","2028-09-04","X","2029-11-26","2030-01-15","X","2028-11-13","2029-01-02","X","2028-11-20","2029-01-09","X","2028-11-22","2029-01-11","X","2029-11-14","2030-01-03","X","2028-11-22",{"$f":"IF(DAY(CL26+9)>15,9,IF(DAY(CL26+9)<8,16,9))+CL26","v":"2029-01-11"},"X","2029-11-19","2030-01-08","X","2029-11-18","2030-01-07","X","2029-11-21","2030-01-10","X","2029-11-25","2030-01-14","X","2029-12-02","2030-01-21","X","2028-11-13","2029-01-02"]
["2028-05-15","2028-08-15","2028-09-19",{"$f":"IF(DAY(OFFSET(INDIRECT(ADDRESS(ROW(),COLUMN())),0,-1))<15,C28+7,IF(DAY(OFFSET(INDIRECT(ADDRESS(ROW(),COLUMN())),0,-1))>21,C28-7,C28+0))","v":"2028-09-19"},null,null,null,null,null,"X","2028-12-03","2029-01-22","X","2028-11-26","2029-01-15",{"$f":"IF(AND(B$8>=Q$27,B$8<=Q$28),Q$28,\"X\")","v":"X"},"2028-11-27","2029-01-16","X","2029-12-24","2030-02-12","X","2028-11-26","2029-01-15","X","2029-07-25","2029-09-13","X","2028-12-03","2029-01-22","X","2029-12-17","2030-02-05","X","2028-12-03",{"$f":"IF(DAY(AJ27)<15,14,IF(DAY(AJ27+14)<8,21,14))+AJ27","v":"2029-01-22"},"X","2028-12-10",{"$f":"EOMONTH(AM27,0)-WEEKDAY(EOMONTH(AM27,0),3)","v":"2029-01-29"},"X","2028-12-04","2029-01-23","X","2029-12-24","2030-02-12","X","2028-11-26","2029-01-15","X","2029-12-31","2030-02-19","X","2028-11-29","2029-01-18","X","2028-11-27","2029-01-16","X","2028-12-05","2029-01-24","X","2030-01-02","2030-02-21","X","2029-12-31","2030-02-19","X","2029-12-03","2030-01-22","X","2028-08-01","2028-09-20","X","2029-12-31","2030-02-19","X","2028-11-27","2029-01-16","X","2028-12-04","2029-01-23","X","2028-12-06","2029-01-25","X","2029-12-19","2030-02-07","X","2028-12-11","2029-01-30","X","2029-12-24","2030-02-12","X","2029-12-16","2030-02-04","X","2029-12-19","2030-02-07","X","2029-12-23","2030-02-11","X","2029-12-30","2030-02-18","X","2028-12-05","2029-01-24"]
["2028-06-12","2028-09-19","2028-10-17",{"$f":"IF(DAY(OFFSET(INDIRECT(ADDRESS(ROW(),COLUMN())),0,-1))<15,C29+7,IF(DAY(OFFSET(INDIRECT(ADDRESS(ROW(),COLUMN())),0,-1))>21,C29-7,C29+0))","v":"2028-10-17"},null,null,null,null,null,"X","2028-12-24","2029-02-12","X","2028-12-17","2029-02-05",{"$f":"IF(AND(B$8>=Q$28,B$8<=Q$29),Q$29,\"X\")","v":"X"},"2028-12-18","2029-02-06","X","2030-01-21","2030-03-12","X","2028-12-17","2029-02-05","X","2029-08-22","2029-10-11","X","2028-12-24","2029-02-12","X","2030-01-14","2030-03-05","X","2028-12-24","2029-02-12","X","2028-12-25",{"$f":"WORKDAY.INTL(EOMONTH(AM28,0),2,\"1011111\")","v":"2029-02-13"},"X","2028-12-25","2029-02-13","X","2030-01-21","2030-03-12","X","2028-12-17","2029-02-05","X","2030-01-28","2030-03-19","X","2028-12-13","2029-02-01","X","2028-12-17","2029-02-05","X","2028-12-26","2029-02-14","X","2030-01-30","2030-03-21","X","2030-01-28","2030-03-19","X","2030-01-07","2030-02-26","X","2028-08-02","2028-09-21","X","2030-01-28","2030-03-19","X","2028-12-18","2029-02-06","X","2028-12-25","2029-02-13","X","2028-12-20","2029-02-08","X","2030-01-16","2030-03-07","X","2028-12-20",{"$f":"IF(DAY(CL28+9)>15,9,IF(DAY(CL28+9)<8,16,9))+CL28","v":"2029-02-08"},"X","2030-01-21","2030-03-12","X","2030-01-13","2030-03-04","X","2030-01-16","2030-03-07","X","2030-01-20","2030-03-11","X","2030-01-27","2030-03-18","X","2028-12-18","2029-02-06"]
["2028-07-10","2028-10-17","2028-11-21",{"$f":"IF(DAY(OFFSET(INDIRECT(ADDRESS(ROW(),COLUMN())),0,-1))<15,C30+7,IF(DAY(OFFSET(INDIRECT(ADDRESS(ROW(),COLUMN())),0,-1))>21,C30-7,C30+0))","v":"2028-11-21"},null,null,null,null,null,"X","2029-01-07","2029-02-26",{"$f":"IF(AND($B$8>=N29,$B$8<=N30),N30,\"X\")","v":"X"},"2028-12-31","2029-02-19",{"$f":"IF(AND(B$8>=Q$29,B$8<=Q$30),Q$30,\"X\")","v":"X"},"2029-01-01","2029-02-20","X","2030-02-18","2030-04-09","X","2028-12-31","2029-02-19","X","2029-09-19","2029-11-08","X","2029-01-07","2029-02-26","X","2030-02-11","2030-04-02","X","2029-01-07","2029-02-26","X","2029-01-07",{"$f":"EOMONTH(AM29,0)-WEEKDAY(EOMONTH(AM29,0),3)","v":"2029-02-26"},"X","2029-01-08","2029-02-27","X","2030-02-18","2030-04-09","X","2028-12-31","2029-02-19","X","2030-02-25","2030-04-16","X","2028-12-27","2029-02-15","X","2029-01-01","2029-02-20","X","2029-01-09","2029-02-28","X","2030-02-27","2030-04-18","X","2030-02-25","2030-04-16","X","2030-02-04","2030-03-26","X","2028-08-13","2028-10-02","X","2030-02-25","2030-04-16","X","2029-01-01","2029-02-20","X","2029-01-08","2029-02-27","X","2029-01-03","2029-02-22","X","2030-02-13","2030-04-04","X","2029-01-08","2029-02-27","X","2030-02-18","2030-04-09","X","2030-02-10","2030-04-01","X","2030-02-13","2030-04-04","X","2030-02-17","2030-04-08","X","2030-02-24","2030-04-15","X","2029-01-09","2029-02-28"]
["2028-08-14","2028-11-21","2028-12-19",{"$f":"IF(DAY(OFFSET(INDIRECT(ADDRESS(ROW(),COLUMN())),0,-1))<15,C31+7,IF(DAY(OFFSET(INDIRECT(ADDRESS(ROW(),COLUMN())),0,-1))>21,C31-7,C31+0))","v":"2028-12-19"},null,null,null,null,null,"X","2029-01-21","2029-03-12","X","2029-01-14","2029-03-05",{"$f":"IF(AND(B$8>=Q$30,B$8<=Q$31),Q$31,\"X\")","v":"X"},"2029-01-15","2029-03-06","X","2030-03-25","2030-05-14","X","2029-01-14","2029-03-05","X","2029-10-24","2029-12-13","X","2029-01-21","2029-03-12",{"$f":"_xlfn.IFS($AE$3=$AF$3,$AG$3,$AE$4=$AF$4,$AG$4,$AE$5=$AF$5,$AG$5,$AE$6=$AF$6,$AG$6,$AE$7=$AF$7,$AG$7,$AE$8=$AF$8,$AG$8,$AE$9=$AF$9,$AG$9,$AE$10=$AF$10,$AG$10,$AE$11=$AF$11,$AG$11,$AE$12=$AF$12,$AG$12,$AE$13=$AF$13,$AG$13,$AE$14=$AF$14,$AG$14,$AE$15=$AF$15,$AG$15,$AE$16=$AF$16,$AG$16,$AE$17=$AF$17,$AG$17,$AE$18=$AF$18,$AG$18,$AE19=$AF19,$AG19,$AE20=$AF20,$AG20,$AE21=$AF21,$AG21,$AE22=$AF22,$AG22,$AE23=$AF23,$AG23,$AE24=$AF24,$AG24,$AE25=$AF25,$AG25,$AE26=$AF26,$AG26,$AE27=$AF27,$AG27,$AE28=$AF28,$AG28,$AE29=$AF29,$AG29,$AE30=$AF30,$AG30)","v":"2028-09-05"},null,null,"X","2029-01-21","2029-03-12","X","2029-01-22",{"$f":"WORKDAY.INTL(EOMONTH(AM30,0),2,\"1011111\")","v":"2029-03-13"},"X","2029-01-22","2029-03-13","X","2030-03-25","2030-05-14","X","2029-01-14","2029-03-05","X","2030-04-01","2030-05-21","X","2029-01-10","2029-03-01","X","2029-01-14","2029-03-05","X","2029-01-23","2029-03-14","X","2030-03-27","2030-05-16","X","2030-04-01","2030-05-21","X","2030-03-04","2030-04-23","X","2028-08-29","2028-10-18","X","2030-04-01","2030-05-21","X","2029-01-15","2029-03-06","X","2029-01-22","2029-03-13","X","2029-01-17","2029-03-08","X","2030-03-13","2030-05-02","X","2029-01-17",{"$f":"IF(DAY(CL30+9)>15,9,IF(DAY(CL30+9)<8,16,9))+CL30","v":"2029-03-08"},"X","2030-03-25","2030-05-14","X","2030-03-17","2030-05-06","X","2030-03-20","2030-05-09","X","2030-03-24","2030-05-13","X","2030-03-31","2030-05-20","X","2029-01-15","2029-03-06"]
["2028-09-11","2028-12-19","2029-01-16",{"$f":"IF(DAY(OFFSET(INDIRECT(ADDRESS(ROW(),COLUMN())),0,-1))<15,C32+7,IF(DAY(OFFSET(INDIRECT(ADDRESS(ROW(),COLUMN())),0,-1))>21,C32-7,C32+0))","v":"2029-01-16"},null,null,null,null,null,"X","2029-02-04","2029-03-26","X","2029-01-28","2029-03-19",{"$f":"IF(AND(B$8>=Q$31,B$8<=Q$32),Q$32,\"X\")","v":"X"},"2029-01-29","2029-03-20","X","2030-04-22","2030-06-11","X","2029-01-28","2029-03-19","X","2029-11-21","2030-01-10","X","2029-02-04","2029-03-26",null,null,null,"X","2029-02-04","2029-03-26","X","2029-02-04",{"$f":"EOMONTH(AM31,0)-WEEKDAY(EOMONTH(AM31,0),3)","v":"2029-03-26"},"X","2029-02-05","2029-03-27","X","2030-04-22","2030-06-11","X","2029-01-28","2029-03-19","X","2030-04-29","2030-06-18","X","2029-01-24","2029-03-15","X","2029-01-29","2029-03-20","X","2029-02-06","2029-03-28","X","2030-05-01","2030-06-20","X","2030-04-29","2030-06-18","X","2030-04-08","2030-05-28",{"$f":"IF(AND($B$8>=BS31,$B$8<=BS32),BS32,\"X\")","v":"X"},"2028-08-30","2028-10-19","X","2030-04-29","2030-06-18","X","2029-01-29","2029-03-20","X","2029-02-05","2029-03-27","X","2029-01-31","2029-03-22","X","2030-04-17","2030-06-06","X","2029-02-05","2029-03-27","X","2030-04-22","2030-06-11","X","2030-04-14","2030-06-03","X","2030-04-17","2030-06-06","X","2030-04-21","2030-06-10","X","2030-04-28","2030-06-17","X","2029-02-06","2029-03-28"]
["2028-10-09","2029-01-16","2029-02-20",{"$f":"IF(DAY(OFFSET(INDIRECT(ADDRESS(ROW(),COLUMN())),0,-1))<15,C33+7,IF(DAY(OFFSET(INDIRECT(ADDRESS(ROW(),COLUMN())),0,-1))>21,C33-7,C33+0))","v":"2029-02-20"},null,null,null,null,null,"X","2029-02-18","2029-04-09","X","2029-02-11","2029-04-02",{"$f":"IF(AND(B$8>=Q$32,B$8<=Q$33),Q$33,\"X\")","v":"X"},"2029-02-12","2029-04-03","X","2030-05-20","2030-07-09","X","2029-02-11","2029-04-02","X","2029-12-26","2030-02-14","X","2029-02-18","2029-04-09",null,null,null,"X","2029-02-18","2029-04-09","X","2029-02-19",{"$f":"WORKDAY.INTL(EOMONTH(AM32,0),2,\"1011111\")","v":"2029-04-10"},"X","2029-02-19","2029-04-10","X","2030-05-20","2030-07-09","X","2029-02-11","2029-04-02","X","2030-05-27","2030-07-16","X","2029-02-14","2029-04-05","X","2029-02-11","2029-04-02","X","2029-02-20","2029-04-11","X","2030-05-29","2030-07-18","X","2030-05-27","2030-07-16","X","2030-05-06","2030-06-25","X","2028-09-17","2028-11-06","X","2030-05-27","2030-07-16","X","2029-02-12","2029-04-03","X","2029-02-19","2029-04-10","X","2029-02-21","2029-04-12","X","2030-05-15","2030-07-04","X","2029-02-21",{"$f":"IF(DAY(CL32+9)>15,9,IF(DAY(CL32+9)<8,16,9))+CL32","v":"2029-04-12"},"X","2030-05-20","2030-07-09","X","2030-05-12","2030-07-01","X","2030-05-15","2030-07-04","X","2030-05-19","2030-07-08","X","2030-05-26","2030-07-15","X","2029-02-12","2029-04-03"]
["2028-11-13","2029-02-20","2029-03-20",{"$f":"IF(DAY(OFFSET(INDIRECT(ADDRESS(ROW(),COLUMN())),0,-1))<15,C34+7,IF(DAY(OFFSET(INDIRECT(ADDRESS(ROW(),COLUMN())),0,-1))>21,C34-7,C34+0))","v":"2029-03-20"},null,null,null,null,{"$f":"_xlfn.IFS($J$3=$K$3,$L$3,$J$4=$K$4,$L$4,$J$5=$K$5,$L$5,$J$6=$K$6,$L$6,$J$7=$K$7,$L$7,$J$8=$K$8,$L$8,$J$9=$K$9,$L$9,$J$10=$K$10,$L$10,$J$11=$K$11,$L$11,$J$12=$K$12,$L$12,$J$13=$K$13,$L$13,$J$14=$K$14,$L$14,$J$15=$K$15,$L$15,$J$16=$K$16,$L$16,$J$17=$K$17,$L$17,$J$18=$K$18,$L$18,$J$19=$K$19,$L$19,$J$20=$K$20,$L$20,$J$21=$K$21,$L$21,$J$22=$K$22,$L$22,$J$23=$K$23,$L$23,$J$24=$K$24,$L$24,$J$25=$K$25,$L$25,$J$26=$K$26,$L$26,$J$27=$K$27,$L$27,$J$28=$K$28,$L$28,$J$29=$K$29,$L$29,$J$30=$K$30,$L$30,$J$31=$K$31,$L$31,$J$32=$K$32,$L$32,$J$33=$K$33,$L$33,$J$34=$K$34,$L$34,$J$35=$K$35,$L$35,$J$36=$K$36,$L$36,$J$37=$K$37,$L$37,$J$38=$K$38,$L$38,$J$39=$K$39,$L$39)","v":"2028-08-14"},"X","2029-03-04","2029-04-23","X","2029-02-25","2029-04-16",{"$f":"IF(AND(B$8>=Q33,B$8<=Q34),Q34,\"X\")","v":"X"},"2029-02-26","2029-04-17","X","2030-06-24","2030-08-13","X","2029-02-25","2029-04-16","X","2030-01-23","2030-03-14","X","2029-03-04","2029-04-23",null,null,null,"X","2029-03-04","2029-04-23","X","2029-03-11",{"$f":"EOMONTH(AM33,0)-WEEKDAY(EOMONTH(AM33,0),3)","v":"2029-04-30"},"X","2029-03-05","2029-04-24","X","2030-06-24","2030-08-13","X","2029-02-25","2029-04-16","X","2030-07-01","2030-08-20","X","2029-02-28","2029-04-19","X","2029-02-26","2029-04-17","X","2029-03-06","2029-04-25","X","2030-06-26","2030-08-15","X","2030-07-01","2030-08-20","X","2030-06-03","2030-07-23","X","2028-09-26","2028-11-15","X","2030-07-01","2030-08-20","X","2029-02-26","2029-04-17",{"$f":"IF(AND($B$8>=CB33,$B$8<=CB34),CB34,\"X\")","v":"X"},"2029-03-05",{"$f":"IF(DAY(CC33)<15,14,IF(DAY(CC33+14)<8,21,14))+CC33","v":"2029-04-24"},"X","2029-03-07","2029-04-26","X","2030-06-12","2030-08-01","X","2029-03-05","2029-04-24","X","2030-06-24","2030-08-13","X","2030-06-16","2030-08-05","X","2030-06-19","2030-08-08","X","2030-06-23","2030-08-12","X","2030-06-30","2030-08-19","X","2029-03-06","2029-04-25"]
["2028-12-11","2029-03-20","2029-04-17",{"$f":"IF(DAY(OFFSET(INDIRECT(ADDRESS(ROW(),COLUMN())),0,-1))<15,C35+7,IF(DAY(OFFSET(INDIRECT(ADDRESS(ROW(),COLUMN())),0,-1))>21,C35-7,C35+0))","v":"2029-04-17"},null,null,null,null,null,{"$f":"IF(AND($B$8>=K34,$B$8<=K35),K35,\"X\")","v":"X"},"2029-03-25","2029-05-14","X","2029-03-18","2029-05-07","X","2029-03-12","2029-05-01","X","2030-07-22","2030-09-10","X","2029-03-18","2029-05-07",{"$f":"_xlfn.IFS($Y$3=$Z$3,$AA$3,$Y$4=$Z$4,$AA$4,$Y$5=$Z$5,$AA$5,$Y$6=$Z$6,$AA$6,$Y$7=$Z$7,$AA$7,$Y$8=$Z$8,$AA$8,$Y$9=$Z$9,$AA$9,$Y$10=$Z$10,$AA$10,$Y$11=$Z$11,$AA$11,$Y$12=$Z$12,$AA$12,$Y$13=$Z$13,$AA$13,$Y$14=$Z$14,$AA$14,$Y$15=$Z$15,$AA$15,$Y$16=$Z$16,$AA$16,$Y$17=$Z$17,$AA$17,$Y$18=$Z$18,$AA$18,$Y$19=$Z$19,$AA$19,$Y$20=$Z$20,$AA$20,$Y$21=$Z$21,$AA$21,$Y$22=$Z$22,$AA$22,$Y$23=$Z$23,$AA$23,$Y$24=$Z$24,$AA$24,$Y$25=$Z$25,$AA$25,$Y$26=$Z$26,$AA$26,$Y$27=$Z$27,$AA$27,$Y$28=$Z$28,$AA$28,$Y$29=$Z$29,$AA$29,$Y$30=$Z$30,$AA$30,$Y$31=$Z$31,$AA$31,$Y$32=$Z$32,$AA$32,$Y$33=$Z$33,$AA$33,$Y$34=$Z$34,$AA$34)","v":"2028-08-10"},"2024-01-11",{"$f":"IF(DAY(OFFSET(INDIRECT(ADDRESS(ROW(),COLUMN())),0,-1))=15,Z35-7,Z35+0)","v":"2024-01-11"},null,null,null,null,null,null,null,null,null,{"$f":"_xlfn.IFS($AK$3=$AL$3,$AM$3,$AK$4=$AL$4,$AM$4,$AK$5=$AL$5,$AM$5,$AK$6=$AL$6,$AM$6,$AK$7=$AL$7,$AM$7,$AK$8=$AL$8,$AM$8,$AK$9=$AL$9,$AM$9,$AK$10=$AL$10,$AM$10,$AK$11=$AL$11,$AM$11,$AK$12=$AL$12,$AM$12,$AK$13=$AL$13,$AM$13,$AK$14=$AL$14,$AM$14,$AK$15=$AL$15,$AM$15,$AK$16=$AL$16,$AM$16,$AK$17=$AL$17,$AM$17,$AK$18=$AL$18,$AM$18,$AK$19=$AL$19,$AM$19,$AK$20=$AL$20,$AM$20,$AK$21=$AL$21,$AM$21,$AK$22=$AL$22,$AM$22,$AK$23=$AL$23,$AM$23,$AK$24=$AL$24,$AM$24,$AK$25=$AL$25,$AM$25,$AK$26=$AL$26,$AM$26,$AK$27=$AL$27,$AM$27,$AK$28=$AL$28,$AM$28,$AK$29=$AL$29,$AM$29,$AK$30=$AL$30,$AM$30,$AK$31=$AL$31,$AM$31,$AK$32=$AL$32,$AM$32,$AK$33=$AL$33,$AM$33,$AK$34=$AL$34,$AM$34)","v":"2028-08-28"},null,null,{"$f":"IF(AND($B$8>=AO34,$B$8<=AO35),AO35,\"X\")","v":"X"},"2029-03-19","2029-05-08","X","2030-07-22","2030-09-10",{"$f":"IF(AND($B$8>=AU34,$B$8<=AU35),AU35,\"X\")","v":"X"},"2029-03-18","2029-05-07","X","2030-07-29","2030-09-17","X","2029-03-14","2029-05-03","X","2029-03-18","2029-05-07",{"$f":"IF(AND($B$8>=BG34,$B$8<=BG35),BG35,\"X\")","v":"X"},"2029-03-20",{"$f":"IF(DAY(BH34)<15,14,IF(DAY(BH34+14)<8,21,14))+BH34","v":"2029-05-09"},{"$f":"_xlfn.IFS($BI$3=$BJ$3,$BK$3,$BI$4=$BJ$4,$BK$4,$BI$5=$BJ$5,$BK$5,$BI$6=$BJ$6,$BK$6,$BI$7=$BJ$7,$BK$7,$BI$8=$BJ$8,$BK$8,$BI$9=$BJ$9,$BK$9,$BI$10=$BJ$10,$BK$10,$BI$11=$BJ$11,$BK$11,$BI$12=$BJ$12,$BK$12,$BI$13=$BJ$13,$BK$13,$BI$14=$BJ$14,$BK$14,$BI$15=$BJ$15,$BK$15,$BI$16=$BJ$16,$BK$16,$BI$17=$BJ$17,$BK$17,$BI$18=$BJ$18,$BK$18,$BI$19=$BJ$19,$BK$19,$BI$20=$BJ$20,$BK$20,$BI$21=$BJ$21,$BK$21,$BI$22=$BJ$22,$BK$22,$BI$23=$BJ$23,$BK$23,$BI$24=$BJ$24,$BK$24,$BI$25=$BJ$25,$BK$25,$BI$26=$BJ$26,$BK$26,$BI$27=$BJ$27,$BK$27,$BI$28=$BJ$28,$BK$28,$BI$29=$BJ$29,$BK$29,$BI$30=$BJ$30,$BK$30,$BI$31=$BJ$31,$BK$31,$BI$32=$BJ$32,$BK$32,$BI$33=$BJ$33,$BK$33,$BI$34=$BJ$34,$BK$34)","v":"2028-08-17"},"2028-01-20",{"$f":"IF(DAY(OFFSET(INDIRECT(ADDRESS(ROW(),COLUMN())),0,-1))<15,BJ35+7,IF(DAY(OFFSET(INDIRECT(ADDRESS(ROW(),COLUMN())),0,-1))>21,BJ35-7,BJ35+0))","v":"2028-01-20"},"X","2030-07-29","2030-09-17","X","2030-07-08","2030-08-27","X","2028-09-27","2028-11-16","X","2030-07-29","2030-09-17","X","2029-03-12","2029-05-01","X","2029-03-19","2029-05-08",{"$f":"IF(AND($B$8>=CE34,$B$8<=CE35),CE35,\"X\")","v":"X"},"2029-03-21","2029-05-10","X","2030-07-17","2030-09-05","X","2029-03-21",{"$f":"IF(DAY(CL34+9)>15,9,IF(DAY(CL34+9)<8,16,9))+CL34","v":"2029-05-10"},"X","2030-07-22","2030-09-10","X","2030-07-14","2030-09-02","X","2030-07-17","2030-09-05","X","2030-07-21","2030-09-09","X","2030-07-28","2030-09-16","X","2029-03-12","2029-05-01"]
["2029-01-08","2029-04-17","2029-05-22",{"$f":"IF(DAY(OFFSET(INDIRECT(ADDRESS(ROW(),COLUMN())),0,-1))<15,C36+7,IF(DAY(OFFSET(INDIRECT(ADDRESS(ROW(),COLUMN())),0,-1))>21,C36-7,C36+0))","v":"2029-05-15"},null,null,null,null,null,{"$f":"IF(AND($B$8>=K35,$B$8<=K36),K36,\"X\")","v":"X"},"2029-04-08","2029-05-28","X","2029-04-01","2029-05-21","X","2029-03-26","2029-05-15","X","2030-08-19","2030-10-08","X","2029-04-01","2029-05-21",null,"2024-02-15",{"$f":"IF(DAY(OFFSET(INDIRECT(ADDRESS(ROW(),COLUMN())),0,-1))=15,Z36-7,Z36+0)","v":"2024-02-08"},null,null,null,null,null,null,null,null,null,null,null,null,{"$f":"IF(AND($B$8>=AO35,$B$8<=AO36),AO36,\"X\")","v":"X"},"2029-04-02","2029-05-22","X","2030-08-19","2030-10-08","X","2029-04-01","2029-05-21","X","2030-09-02","2030-10-22","X","2029-03-28","2029-05-17","X","2029-03-26","2029-05-15",{"$f":"IF(AND($B$8>=BG35,$B$8<=BG36),BG36,\"X\")","v":"X"},"2029-04-03",{"$f":"IF(DAY(BH35)<15,14,IF(DAY(BH35+14)<8,21,14))+BH35","v":"2029-05-23"},null,"2028-02-17",{"$f":"IF(DAY(OFFSET(INDIRECT(ADDRESS(ROW(),COLUMN())),0,-1))<15,BJ36+7,IF(DAY(OFFSET(INDIRECT(ADDRESS(ROW(),COLUMN())),0,-1))>21,BJ36-7,BJ36+0))","v":"2028-02-17"},"X","2030-08-26","2030-10-15","X","2030-08-05","2030-09-24","X","2028-10-15","2028-12-04","X","2030-08-26","2030-10-15","X","2029-03-26","2029-05-15","X","2029-04-02","2029-05-22",{"$f":"IF(AND($B$8>=CE35,$B$8<=CE36),CE36,\"X\")","v":"X"},"2029-04-04","2029-05-24","X","2030-08-14","2030-10-03","X","2029-04-09","2029-05-29","X","2030-08-19","2030-10-08","X","2030-08-18","2030-10-07","X","2030-08-21","2030-10-10","X","2030-08-25","2030-10-14","X","2030-09-01","2030-10-21","X","2029-04-03","2029-05-23"]
["2029-02-12","2029-05-15","2029-06-19",{"$f":"IF(DAY(OFFSET(INDIRECT(ADDRESS(ROW(),COLUMN())),0,-1))<15,C37+7,IF(DAY(OFFSET(INDIRECT(ADDRESS(ROW(),COLUMN())),0,-1))>21,C37-7,C37+0))","v":"2029-06-19"},null,null,null,null,null,{"$f":"IF(AND($B$8>=K36,$B$8<=K37),K37,\"X\")","v":"X"},"2029-04-22","2029-06-11","X","2029-04-15","2029-06-04","X","2029-04-16","2029-06-05","X","2030-09-23","2030-11-12","X","2029-04-15","2029-06-04",null,"2024-03-14",{"$f":"IF(DAY(OFFSET(INDIRECT(ADDRESS(ROW(),COLUMN())),0,-1))=15,Z37-7,Z37+0)","v":"2024-03-14"},null,null,null,null,null,null,null,null,null,null,null,null,{"$f":"IF(AND($B$8>=AO36,$B$8<=AO37),AO37,\"X\")","v":"X"},"2029-04-23","2029-06-12","X","2030-09-23","2030-11-12","X","2029-04-15","2029-06-04","X","2030-09-30","2030-11-19","X","2029-04-18","2029-06-07","X","2029-04-15","2029-06-04","X","2029-04-24","2029-06-13",null,"2028-03-16",{"$f":"IF(DAY(OFFSET(INDIRECT(ADDRESS(ROW(),COLUMN())),0,-1))<15,BJ37+7,IF(DAY(OFFSET(INDIRECT(ADDRESS(ROW(),COLUMN())),0,-1))>21,BJ37-7,BJ37+0))","v":"2028-03-16"},"X","2030-09-30","2030-11-19","X","2030-09-02","2030-10-22","X","2028-10-31","2028-12-20","X","2030-09-30","2030-11-19","X","2029-04-16","2029-06-05","X","2029-04-23","2029-06-12",{"$f":"IF(AND($B$8>=CE36,$B$8<=CE37),CE37,\"X\")","v":"X"},"2029-04-25","2029-06-14","X","2030-09-18","2030-11-07","X","2029-04-25",{"$f":"IF(DAY(CL36+9)>15,9,IF(DAY(CL36+9)<8,16,9))+CL36","v":"2029-06-14"},"X","2030-09-23","2030-11-12","X","2030-09-15","2030-11-04","X","2030-09-18","2030-11-07","X","2030-09-22","2030-11-11","X","2030-09-29","2030-11-18","X","2029-04-16","2029-06-05"]
["2029-03-12","2029-06-19","2029-07-17",{"$f":"IF(DAY(OFFSET(INDIRECT(ADDRESS(ROW(),COLUMN())),0,-1))<15,C38+7,IF(DAY(OFFSET(INDIRECT(ADDRESS(ROW(),COLUMN())),0,-1))>21,C38-7,C38+0))","v":"2029-07-17"},null,null,null,null,null,{"$f":"IF(AND($B$8>=K37,$B$8<=K38),K38,\"X\")","v":"X"},"2029-05-06","2029-06-25","X","2029-04-29","2029-06-18","X","2029-04-30","2029-06-19","X","2030-10-21","2030-12-10","X","2029-04-29","2029-06-18",null,"2024-04-11",{"$f":"IF(DAY(OFFSET(INDIRECT(ADDRESS(ROW(),COLUMN())),0,-1))=15,Z38-7,Z38+0)","v":"2024-04-11"},null,null,null,null,null,null,null,null,null,null,null,null,{"$f":"IF(AND($B$8>=AO37,$B$8<=AO38),AO38,\"X\")","v":"X"},"2029-05-07","2029-06-26","X","2030-10-21","2030-12-10","X","2029-04-29","2029-06-18","X","2030-10-28","2030-12-17","X","2029-05-02","2029-06-21","X","2029-04-30","2029-06-19","X","2029-05-08","2029-06-27",null,"2028-04-20",{"$f":"IF(DAY(OFFSET(INDIRECT(ADDRESS(ROW(),COLUMN())),0,-1))<15,BJ38+7,IF(DAY(OFFSET(INDIRECT(ADDRESS(ROW(),COLUMN())),0,-1))>21,BJ38-7,BJ38+0))","v":"2028-04-20"},"X","2030-10-28","2030-12-17","X","2030-10-07","2030-11-26","X","2028-11-01","2028-12-21","X","2030-10-28","2030-12-17","X","2029-04-30","2029-06-19","X","2029-05-07","2029-06-26",{"$f":"IF(AND($B$8>=CE37,$B$8<=CE38),CE38,\"X\")","v":"X"},"2029-05-09","2029-06-28","X","2030-10-16","2030-12-05","X","2029-05-07","2029-06-26","X","2030-10-21","2030-12-10","X","2030-10-13","2030-12-02","X","2030-10-16","2030-12-05","X","2030-10-20","2030-12-09","X","2030-10-27","2030-12-16","X","2029-05-08","2029-06-27"]
["2029-04-09","2029-07-17","2029-08-21",{"$f":"IF(DAY(OFFSET(INDIRECT(ADDRESS(ROW(),COLUMN())),0,-1))<15,C39+7,IF(DAY(OFFSET(INDIRECT(ADDRESS(ROW(),COLUMN())),0,-1))>21,C39-7,C39+0))","v":"2029-08-21"},null,null,null,null,null,{"$f":"IF(AND($B$8>=K38,$B$8<=K39),K39,\"X\")","v":"X"},"2029-05-20","2029-07-09","X","2029-05-13",{"$f":"O76","v":"2029-07-02"},"X","2029-05-14","2029-07-03","X","2030-11-25","2031-01-14","X","2029-05-13","2029-07-02",null,"2024-05-09",{"$f":"IF(DAY(OFFSET(INDIRECT(ADDRESS(ROW(),COLUMN())),0,-1))=15,Z39-7,Z39+0)","v":"2024-05-09"},null,null,null,null,null,null,null,null,null,null,null,null,{"$f":"IF(AND($B$8>=AO38,$B$8<=AO39),AO39,\"X\")","v":"X"},"2029-05-21","2029-07-10","X","2030-11-25","2031-01-14","X","2029-05-13","2029-07-02","X","2030-12-02","2031-01-21","X","2029-05-16","2029-07-05","X","2029-05-13","2029-07-02","X","2029-05-22","2029-07-11",null,"2028-05-18",{"$f":"IF(DAY(OFFSET(INDIRECT(ADDRESS(ROW(),COLUMN())),0,-1))<15,BJ39+7,IF(DAY(OFFSET(INDIRECT(ADDRESS(ROW(),COLUMN())),0,-1))>21,BJ39-7,BJ39+0))","v":"2028-05-18"},"X","2030-12-02","2031-01-21","X","2030-11-04","2030-12-24","X","2028-11-12","2029-01-01","X","2030-12-02","2031-01-21","X","2029-05-14","2029-07-03","X","2029-05-21","2029-07-10",{"$f":"IF(AND($B$8>=CE38,$B$8<=CE39),CE39,\"X\")","v":"X"},"2029-05-23","2029-07-12","X","2030-11-13","2031-01-02","X",{"$f":"CL39-INDEX($G$41:$K$133, MATCH($B$2, $G$41:$G$133, 0), 5)","v":"2029-05-23"},{"$f":"IF(DAY(CL38+9)>15,9,IF(DAY(CL38+9)<8,16,9))+CL38","v":"2029-07-12"},"X","2030-11-25","2031-01-14","X","2030-11-17","2031-01-06","X","2030-11-20","2031-01-09","X","2030-11-24","2031-01-13","X","2031-11-30","2032-01-19","X","2029-05-14","2029-07-03"]
["2029-05-14","2029-08-21","2029-09-18",{"$f":"IF(DAY(OFFSET(INDIRECT(ADDRESS(ROW(),COLUMN())),0,-1))<15,C40+7,IF(DAY(OFFSET(INDIRECT(ADDRESS(ROW(),COLUMN())),0,-1))>21,C40-7,C40+0))","v":"2029-09-18"},null,null,"Owners","Owner Council Meeting",null,"Extra Review Time\n(In days)","Agenda Cutoff\n(In days)","Execution time\n(In days)",{"$f":"_xlfn.IFS($M$3=$N$3,$O$3,$M$4=$N$4,$O$4,$M$5=$N$5,$O$5,$M$6=$N$6,$O$6,$M$7=$N$7,$O$7,$M$8=$N$8,$O$8,$M$9=$N$9,$O$9,$M$10=$N$10,$O$10,$M$11=$N$11,$O$11,$M$12=$N$12,$O$12,$M$13=$N$13,$O$13,$M$14=$N$14,$O$14,$M$15=$N$15,$O$15,$M$16=$N$16,$O$16,$M$17=$N$17,$O$17,$M$18=$N$18,$O$18,$M$19=$N$19,$O$19,$M$20=$N$20,$O$20,$M$21=$N$21,$O$21,$M$22=$N$22,$O$22,$M$23=$N$23,$O$23,$M$24=$N$24,$O$24,$M$25=$N$25,$O$25,$M$26=$N$26,$O$26,$M$27=$N$27,$O$27,$M$28=$N$28,$O$28,$M$29=$N$29,$O$29,$M$30=$N$30,$O$30,$M$31=$N$31,$O$31,$M$32=$N$32,$O$32,$M$33=$N$33,$O$33,$M$34=$N$34,$O$34,$M$35=$N$35,$O$35,$M$36=$N$36,$O$36,$M$37=$N$37,$O$37,$M$38=$N$38,$O$38,$M$39=$N$39,$O$39)","v":"2028-08-21"},"2028-01-03",{"$f":"IF(DAY(OFFSET(INDIRECT(ADDRESS(ROW(),COLUMN())),0,-1))>21,N40+7,IF(DAY(OFFSET(INDIRECT(ADDRESS(ROW(),COLUMN())),0,-1))<7,N40+0,IF(AND(DAY(OFFSET(INDIRECT(ADDRESS(ROW(),COLUMN())),0,-1))>7,DAY(OFFSET(INDIRECT(ADDRESS(ROW(),COLUMN())),0,-1))<15),N40+7,N40+0)))","v":"2028-01-03"},{"$f":"_xlfn.IFS($P$3=$Q$3,$R$3,$P$4=$Q$4,$R$4,$P$5=$Q$5,$R$5,$P$6=$Q$6,$R$6,$P$7=$Q$7,$R$7,$P$8=$Q$8,$R$8,$P$9=$Q$9,$R$9,$P$10=$Q$10,$R$10,$P$11=$Q$11,$R$11,$P$12=$Q$12,$R$12,$P$13=$Q$13,$R$13,$P$14=$Q$14,$R$14,$P$15=$Q$15,$R$15,$P$16=$Q$16,$R$16,$P$17=$Q$17,$R$17,$P$18=$Q$18,$R$18,$P$19=$Q$19,$R$19,$P$20=$Q$20,$R$20,$P$21=$Q$21,$R$21,$P$22=$Q$22,$R$22,$P$23=$Q$23,$R$23,$P$24=$Q$24,$R$24,$P$25=$Q$25,$R$25,$P$26=$Q$26,$R$26,$P$27=$Q$27,$R$27,$P$28=$Q$28,$R$28,$P$29=$Q$29,$R$29,$P$30=$Q$30,$R$30,$P$31=$Q$31,$R$31,$P$32=$Q$32,$R$32,$P$33=$Q$33,$R$33,$P$34=$Q$34,$R$34,$P$35=$Q$35,$R$35,$P$36=$Q$36,$R$36,$P$37=$Q$37,$R$37,$P$38=$Q$38,$R$38,$P$39=$Q$39,$R$39)","v":"2028-08-15"},"2028-01-04",{"$f":"IF(DAY(OFFSET(INDIRECT(ADDRESS(ROW(),COLUMN())),0,-1))>21,Q40+7,IF(DAY(OFFSET(INDIRECT(ADDRESS(ROW(),COLUMN())),0,-1))<7,Q40+0,IF(AND(DAY(OFFSET(INDIRECT(ADDRESS(ROW(),COLUMN())),0,-1))>7,DAY(OFFSET(INDIRECT(ADDRESS(ROW(),COLUMN())),0,-1))<15),Q40+7,Q40+0)))","v":"2028-01-04"},{"$f":"_xlfn.IFS($S$3=$T$3,$U$3,$S$4=$T$4,$U$4,$S$5=$T$5,$U$5,$S$6=$T$6,$U$6,$S$7=$T$7,$U$7,$S$8=$T$8,$U$8,$S$9=$T$9,$U$9,$S$10=$T$10,$U$10,$S$11=$T$11,$U$11,$S$12=$T$12,$U$12,$S$13=$T$13,$U$13,$S$14=$T$14,$U$14,$S$15=$T$15,$U$15,$S$16=$T$16,$U$16,$S$17=$T$17,$U$17,$S$18=$T$18,$U$18,$S$19=$T$19,$U$19,$S$20=$T$20,$U$20,$S$21=$T$21,$U$21,$S$22=$T$22,$U$22,$S$23=$T$23,$U$23,$S$24=$T$24,$U$24,$S$25=$T$25,$U$25,$S$26=$T$26,$U$26,$S$27=$T$27,$U$27,$S$28=$T$28,$U$28,$S$29=$T$29,$U$29,$S$30=$T$30,$U$30,$S$31=$T$31,$U$31,$S$32=$T$32,$U$32,$S$33=$T$33,$U$33,$S$34=$T$34,$U$34,$S$35=$T$35,$U$35,$S$36=$T$36,$U$36,$S$37=$T$37,$U$37,$S$38=$T$38,$U$38,$S$39=$T$39,$U$39)","v":"2028-08-15"},"2028-01-11",{"$f":"IF(DAY(OFFSET(INDIRECT(ADDRESS(ROW(),COLUMN())),0,-1))<8,T40+7,T40+0)","v":"2028-01-11"},null,"2028-01-03",{"$f":"IF(DAY(OFFSET(INDIRECT(ADDRESS(ROW(),COLUMN())),0,-1))>21,W40+7,IF(DAY(OFFSET(INDIRECT(ADDRESS(ROW(),COLUMN())),0,-1))<7,W40+0,IF(AND(DAY(OFFSET(INDIRECT(ADDRESS(ROW(),COLUMN())),0,-1))>7,DAY(OFFSET(INDIRECT(ADDRESS(ROW(),COLUMN())),0,-1))<15),W40+7,W40+0)))","v":"2028-01-03"},null,"2028-01-13",{"$f":"IF(DAY(OFFSET(INDIRECT(ADDRESS(ROW(),COLUMN())),0,-1))=15,Z40-7,Z40+0)","v":"2028-01-13"},null,null,null,null,null,null,null,null,null,null,null,null,{"$f":"_xlfn.IFS($AN$3=$AO$3,$AP$3,$AN$4=$AO$4,$AP$4,$AN$5=$AO$5,$AP$5,$AN$6=$AO$6,$AP$6,$AN$7=$AO$7,$AP$7,$AN$8=$AO$8,$AP$8,$AN$9=$AO$9,$AP$9,$AN$10=$AO$10,$AP$10,$AN$11=$AO$11,$AP$11,$AN$12=$AO$12,$AP$12,$AN$13=$AO$13,$AP$13,$AN$14=$AO$14,$AP$14,$AN$15=$AO$15,$AP$15,$AN$16=$AO$16,$AP$16,$AN$17=$AO$17,$AP$17,$AN$18=$AO$18,$AP$18,$AN$19=$AO$19,$AP$19,$AN$20=$AO$20,$AP$20,$AN$21=$AO$21,$AP$21,$AN$22=$AO$22,$AP$22,$AN$23=$AO$23,$AP$23,$AN$24=$AO$24,$AP$24,$AN$25=$AO$25,$AP$25,$AN$26=$AO$26,$AP$26,$AN$27=$AO$27,$AP$27,$AN$28=$AO$28,$AP$28,$AN$29=$AO$29,$AP$29,$AN$30=$AO$30,$AP$30,$AN$31=$AO$31,$AP$31,$AN$32=$AO$32,$AP$32,$AN$33=$AO$33,$AP$33,$AN$34=$AO$34,$AP$34,$AN$35=$AO$35,$AP$35,$AN$36=$AO$36,$AP$36,$AN$37=$AO$37,$AP$37,$AN$38=$AO$38,$AP$38,$AN$39=$AO$39,$AP$39)","v":"2028-08-22"},null,null,{"$f":"_xlfn.IFS($AQ$3=$AR$3,$AS$3,$AQ$4=$AR$4,$AS$4,$AQ$5=$AR$5,$AS$5,$AQ$6=$AR$6,$AS$6,$AQ$7=$AR$7,$AS$7,$AQ$8=$AR$8,$AS$8,$AQ$9=$AR$9,$AS$9,$AQ$10=$AR$10,$AS$10,$AQ$11=$AR$11,$AS$11,$AQ$12=$AR$12,$AS$12,$AQ$13=$AR$13,$AS$13,$AQ$14=$AR$14,$AS$14,$AQ$15=$AR$15,$AS$15,$AQ$16=$AR$16,$AS$16,$AQ$17=$AR$17,$AS$17,$AQ$18=$AR$18,$AS$18,$AQ$19=$AR$19,$AS$19,$AQ$20=$AR$20,$AS$20,$AQ$21=$AR$21,$AS$21,$AQ$22=$AR$22,$AS$22,$AQ$23=$AR$23,$AS$23,$AQ$24=$AR$24,$AS$24,$AQ$25=$AR$25,$AS$25,$AQ$26=$AR$26,$AS$26,$AQ$27=$AR$27,$AS$27,$AQ$28=$AR$28,$AS$28,$AQ$29=$AR$29,$AS$29,$AQ$30=$AR$30,$AS$30,$AQ$31=$AR$31,$AS$31,$AQ$32=$AR$32,$AS$32,$AQ$33=$AR$33,$AS$33,$AQ$34=$AR$34,$AS$34,$AQ$35=$AR$35,$AS$35,$AQ$36=$AR$36,$AS$36,$AQ$37=$AR$37,$AS$37,$AQ$38=$AR$38,$AS$38,$AQ$39=$AR$39,$AS$39)","v":"2028-09-12"},"2028-01-11",{"$f":"IF(DAY(OFFSET(INDIRECT(ADDRESS(ROW(),COLUMN())),0,-1))<8,AR40+7,AR40+0)","v":"2028-01-11"},null,"2028-01-03",{"$f":"IF(DAY(OFFSET(INDIRECT(ADDRESS(ROW(),COLUMN())),0,-1))>21,AU40+7,IF(DAY(OFFSET(INDIRECT(ADDRESS(ROW(),COLUMN())),0,-1))<7,AU40+0,IF(AND(DAY(OFFSET(INDIRECT(ADDRESS(ROW(),COLUMN())),0,-1))>7,DAY(OFFSET(INDIRECT(ADDRESS(ROW(),COLUMN())),0,-1))<15),AU40+7,AU40+0)))","v":"2028-01-03"},{"$f":"_xlfn.IFS($AW$3=$AX$3,$AY$3,$AW$4=$AX$4,$AY$4,$AW$5=$AX$5,$AY$5,$AW$6=$AX$6,$AY$6,$AW$7=$AX$7,$AY$7,$AW$8=$AX$8,$AY$8,$AW$9=$AX$9,$AY$9,$AW$10=$AX$10,$AY$10,$AW$11=$AX$11,$AY$11,$AW$12=$AX$12,$AY$12,$AW$13=$AX$13,$AY$13,$AW$14=$AX$14,$AY$14,$AW$15=$AX$15,$AY$15,$AW$16=$AX$16,$AY$16,$AW$17=$AX$17,$AY$17,$AW$18=$AX$18,$AY$18,$AW$19=$AX$19,$AY$19,$AW$20=$AX$20,$AY$20,$AW$21=$AX$21,$AY$21,$AW$22=$AX$22,$AY$22,$AW$23=$AX$23,$AY$23,$AW$24=$AX$24,$AY$24,$AW$25=$AX$25,$AY$25,$AW$26=$AX$26,$AY$26,$AW$27=$AX$27,$AY$27,$AW$28=$AX$28,$AY$28,$AW$29=$AX$29,$AY$29,$AW$30=$AX$30,$AY$30,$AW$31=$AX$31,$AY$31,$AW$32=$AX$32,$AY$32,$AW$33=$AX$33,$AY$33,$AW$34=$AX$34,$AY$34,$AW$35=$AX$35,$AY$35,$AW$36=$AX$36,$AY$36,$AW$37=$AX$37,$AY$37,$AW$38=$AX$38,$AY$38,$AW$39=$AX$39,$AY$39)","v":"2028-08-22"},"2028-01-18",{"$f":"IF(DAY(OFFSET(INDIRECT(ADDRESS(ROW(),COLUMN())),0,-1))<16,AX40+7,AX40+0)","v":"2028-01-18"},{"$f":"_xlfn.IFS($AZ$3=$BA$3,$BB$3,$AZ$4=$BA$4,$BB$4,$AZ$5=$BA$5,$BB$5,$AZ$6=$BA$6,$BB$6,$AZ$7=$BA$7,$BB$7,$AZ$8=$BA$8,$BB$8,$AZ$9=$BA$9,$BB$9,$AZ$10=$BA$10,$BB$10,$AZ$11=$BA$11,$BB$11,$AZ$12=$BA$12,$BB$12,$AZ$13=$BA$13,$BB$13,$AZ$14=$BA$14,$BB$14,$AZ$15=$BA$15,$BB$15,$AZ$16=$BA$16,$BB$16,$AZ$17=$BA$17,$BB$17,$AZ$18=$BA$18,$BB$18,$AZ$19=$BA$19,$BB$19,$AZ$20=$BA$20,$BB$20,$AZ$21=$BA$21,$BB$21,$AZ$22=$BA$22,$BB$22,$AZ$23=$BA$23,$BB$23,$AZ$24=$BA$24,$BB$24,$AZ$25=$BA$25,$BB$25,$AZ$26=$BA$26,$BB$26,$AZ$27=$BA$27,$BB$27,$AZ$28=$BA$28,$BB$28,$AZ$29=$BA$29,$BB$29,$AZ$30=$BA$30,$BB$30,$AZ$31=$BA$31,$BB$31,$AZ$32=$BA$32,$BB$32,$AZ$33=$BA$33,$BB$33,$AZ$34=$BA$34,$BB$34,$AZ$35=$BA$35,$BB$35,$AZ$36=$BA$36,$BB$36,$AZ$37=$BA$37,$BB$37,$AZ$38=$BA$38,$BB$38,$AZ$39=$BA$39,$BB$39)","v":"2028-08-17"},"2027-12-30",{"$f":"IF(DAY(OFFSET(INDIRECT(ADDRESS(ROW(),COLUMN())),0,-1))>21,BA40+7,IF(DAY(OFFSET(INDIRECT(ADDRESS(ROW(),COLUMN())),0,-1))<7,BA40+0,IF(AND(DAY(OFFSET(INDIRECT(ADDRESS(ROW(),COLUMN())),0,-1))>7,DAY(OFFSET(INDIRECT(ADDRESS(ROW(),COLUMN())),0,-1))<15),BA40+7,BA40+0)))","v":"2028-01-06"},{"$f":"_xlfn.IFS($BC$3=$BD$3,$BE$3,$BC$4=$BD$4,$BE$4,$BC$5=$BD$5,$BE$5,$BC$6=$BD$6,$BE$6,$BC$7=$BD$7,$BE$7,$BC$8=$BD$8,$BE$8,$BC$9=$BD$9,$BE$9,$BC$10=$BD$10,$BE$10,$BC$11=$BD$11,$BE$11,$BC$12=$BD$12,$BE$12,$BC$13=$BD$13,$BE$13,$BC$14=$BD$14,$BE$14,$BC$15=$BD$15,$BE$15,$BC$16=$BD$16,$BE$16,$BC$17=$BD$17,$BE$17,$BC$18=$BD$18,$BE$18,$BC$19=$BD$19,$BE$19,$BC$20=$BD$20,$BE$20,$BC$21=$BD$21,$BE$21,$BC$22=$BD$22,$BE$22,$BC$23=$BD$23,$BE$23,$BC$24=$BD$24,$BE$24,$BC$25=$BD$25,$BE$25,$BC$26=$BD$26,$BE$26,$BC$27=$BD$27,$BE$27,$BC$28=$BD$28,$BE$28,$BC$29=$BD$29,$BE$29,$BC$30=$BD$30,$BE$30,$BC$31=$BD$31,$BE$31,$BC$32=$BD$32,$BE$32,$BC$33=$BD$33,$BE$33,$BC$34=$BD$34,$BE$34,$BC$35=$BD$35,$BE$35,$BC$36=$BD$36,$BE$36,$BC$37=$BD$37,$BE$37,$BC$38=$BD$38,$BE$38,$BC$39=$BD$39,$BE$39)","v":"2028-08-15"},"2028-01-03",{"$f":"IF(DAY(OFFSET(INDIRECT(ADDRESS(ROW(),COLUMN())),0,-1))>21,BD40+7,IF(DAY(OFFSET(INDIRECT(ADDRESS(ROW(),COLUMN())),0,-1))<7,BD40+0,IF(AND(DAY(OFFSET(INDIRECT(ADDRESS(ROW(),COLUMN())),0,-1))>7,DAY(OFFSET(INDIRECT(ADDRESS(ROW(),COLUMN())),0,-1))<15),BD40+7,BD40+0)))","v":"2028-01-03"},{"$f":"_xlfn.IFS($BF$3=$BG$3,$BH$3,$BF$4=$BG$4,$BH$4,$BF$5=$BG$5,$BH$5,$BF$6=$BG$6,$BH$6,$BF$7=$BG$7,$BH$7,$BF$8=$BG$8,$BH$8,$BF$9=$BG$9,$BH$9,$BF$10=$BG$10,$BH$10,$BF$11=$BG$11,$BH$11,$BF$12=$BG$12,$BH$12,$BF$13=$BG$13,$BH$13,$BF$14=$BG$14,$BH$14,$BF$15=$BG$15,$BH$15,$BF$16=$BG$16,$BH$16,$BF$17=$BG$17,$BH$17,$BF$18=$BG$18,$BH$18,$BF$19=$BG$19,$BH$19,$BF$20=$BG$20,$BH$20,$BF$21=$BG$21,$BH$21,$BF$22=$BG$22,$BH$22,$BF$23=$BG$23,$BH$23,$BF$24=$BG$24,$BH$24,$BF$25=$BG$25,$BH$25,$BF$26=$BG$26,$BH$26,$BF$27=$BG$27,$BH$27,$BF$28=$BG$28,$BH$28,$BF$29=$BG$29,$BH$29,$BF$30=$BG$30,$BH$30,$BF$31=$BG$31,$BH$31,$BF$32=$BG$32,$BH$32,$BF$33=$BG$33,$BH$33,$BF$34=$BG$34,$BH$34,$BF$35=$BG$35,$BH$35,$BF$36=$BG$36,$BH$36,$BF$37=$BG$37,$BH$37,$BF$38=$BG$38,$BH$38,$BF$39=$BG$39,$BH$39)","v":"2028-08-09"},"2028-01-04",null,null,"2028-06-22",{"$f":"IF(DAY(OFFSET(INDIRECT(ADDRESS(ROW(),COLUMN())),0,-1))<15,BJ40+7,IF(DAY(OFFSET(INDIRECT(ADDRESS(ROW(),COLUMN())),0,-1))>21,BJ40-7,BJ40+0))","v":"2028-06-15"},{"$f":"_xlfn.IFS($BL$3=$BM$3,$BN$3,$BL$4=$BM$4,$BN$4,$BL$5=$BM$5,$BN$5,$BL$6=$BM$6,$BN$6,$BL$7=$BM$7,$BN$7,$BL$8=$BM$8,$BN$8,$BL$9=$BM$9,$BN$9,$BL$10=$BM$10,$BN$10,$BL$11=$BM$11,$BN$11,$BL$12=$BM$12,$BN$12,$BL$13=$BM$13,$BN$13,$BL$14=$BM$14,$BN$14,$BL$15=$BM$15,$BN$15,$BL$16=$BM$16,$BN$16,$BL$17=$BM$17,$BN$17,$BL$18=$BM$18,$BN$18,$BL$19=$BM$19,$BN$19,$BL$20=$BM$20,$BN$20,$BL$21=$BM$21,$BN$21,$BL$22=$BM$22,$BN$22,$BL$23=$BM$23,$BN$23,$BL$24=$BM$24,$BN$24,$BL$25=$BM$25,$BN$25,$BL$26=$BM$26,$BN$26,$BL$27=$BM$27,$BN$27,$BL$28=$BM$28,$BN$28,$BL$29=$BM$29,$BN$29,$BL$30=$BM$30,$BN$30,$BL$31=$BM$31,$BN$31,$BL$32=$BM$32,$BN$32,$BL$33=$BM$33,$BN$33,$BL$34=$BM$34,$BN$34,$BL$35=$BM$35,$BN$35,$BL$36=$BM$36,$BN$36,$BL$37=$BM$37,$BN$37,$BL$38=$BM$38,$BN$38,$BL$39=$BM$39,$BN$39)","v":"2028-08-15"},"2028-01-18",{"$f":"IF(DAY(OFFSET(INDIRECT(ADDRESS(ROW(),COLUMN())),0,-1))<15,BM40+7,IF(DAY(OFFSET(INDIRECT(ADDRESS(ROW(),COLUMN())),0,-1))>21,BM40-7,BM40+0))","v":"2028-01-18"},{"$f":"_xlfn.IFS($BO$3=$BP$3,$BQ$3,$BO$4=$BP$4,$BQ$4,$BO$5=$BP$5,$BQ$5,$BO$6=$BP$6,$BQ$6,$BO$7=$BP$7,$BQ$7,$BO$8=$BP$8,$BQ$8,$BO$9=$BP$9,$BQ$9,$BO$10=$BP$10,$BQ$10,$BO$11=$BP$11,$BQ$11,$BO$12=$BP$12,$BQ$12,$BO$13=$BP$13,$BQ$13,$BO$14=$BP$14,$BQ$14,$BO$15=$BP$15,$BQ$15,$BO$16=$BP$16,$BQ$16,$BO$17=$BP$17,$BQ$17,$BO$18=$BP$18,$BQ$18,$BO$19=$BP$19,$BQ$19,$BO$20=$BP$20,$BQ$20,$BO$21=$BP$21,$BQ$21,$BO$22=$BP$22,$BQ$22,$BO$23=$BP$23,$BQ$23,$BO$24=$BP$24,$BQ$24,$BO$25=$BP$25,$BQ$25,$BO$26=$BP$26,$BQ$26,$BO$27=$BP$27,$BQ$27,$BO$28=$BP$28,$BQ$28,$BO$29=$BP$29,$BQ$29,$BO$30=$BP$30,$BQ$30,$BO$31=$BP$31,$BQ$31,$BO$32=$BP$32,$BQ$32,$BO$33=$BP$33,$BQ$33,$BO$34=$BP$34,$BQ$34,$BO$35=$BP$35,$BQ$35,$BO$36=$BP$36,$BQ$36,$BO$37=$BP$37,$BQ$37,$BO$38=$BP$38,$BQ$38,$BO$39=$BP$39,$BQ$39)","v":"2028-08-22"},"2027-12-28",{"$f":"IF(DAY(OFFSET(INDIRECT(ADDRESS(ROW(),COLUMN())),0,-1))<21,BP40+7,IF(DAY(OFFSET(INDIRECT(ADDRESS(ROW(),COLUMN())),0,-1))>28,BP40-7,BP40+0))","v":"2027-12-28"},"X","2028-11-28","2029-01-17",{"$f":"_xlfn.IFS($BU$3=$BV$3,$BW$3,$BU$4=$BV$4,$BW$4,$BU$5=$BV$5,$BW$5,$BU$6=$BV$6,$BW$6,$BU$7=$BV$7,$BW$7,$BU$8=$BV$8,$BW$8,$BU$9=$BV$9,$BW$9,$BU$10=$BV$10,$BW$10,$BU$11=$BV$11,$BW$11,$BU$12=$BV$12,$BW$12,$BU$13=$BV$13,$BW$13,$BU$14=$BV$14,$BW$14,$BU$15=$BV$15,$BW$15,$BU$16=$BV$16,$BW$16,$BU$17=$BV$17,$BW$17,$BU$18=$BV$18,$BW$18,$BU$19=$BV$19,$BW$19,$BU$20=$BV$20,$BW$20,$BU$21=$BV$21,$BW$21,$BU$22=$BV$22,$BW$22,$BU$23=$BV$23,$BW$23,$BU$24=$BV$24,$BW$24,$BU$25=$BV$25,$BW$25,$BU$26=$BV$26,$BW$26,$BU$27=$BV$27,$BW$27,$BU$28=$BV$28,$BW$28,$BU$29=$BV$29,$BW$29,$BU$30=$BV$30,$BW$30,$BU$31=$BV$31,$BW$31,$BU$32=$BV$32,$BW$32,$BU$33=$BV$33,$BW$33,$BU$34=$BV$34,$BW$34,$BU$35=$BV$35,$BW$35,$BU$36=$BV$36,$BW$36,$BU$37=$BV$37,$BW$37,$BU$38=$BV$38,$BW$38,$BU$39=$BV$39,$BW$39)","v":"2028-08-15"},"2028-01-18",{"$f":"IF(DAY(OFFSET(INDIRECT(ADDRESS(ROW(),COLUMN())),0,-1))<15,BV40+7,IF(DAY(OFFSET(INDIRECT(ADDRESS(ROW(),COLUMN())),0,-1))>21,BV40-7,BV40+0))","v":"2028-01-18"},null,"2028-01-04",{"$f":"IF(DAY(OFFSET(INDIRECT(ADDRESS(ROW(),COLUMN())),0,-1))>21,BY40+7,IF(DAY(OFFSET(INDIRECT(ADDRESS(ROW(),COLUMN())),0,-1))<7,BY40+0,IF(AND(DAY(OFFSET(INDIRECT(ADDRESS(ROW(),COLUMN())),0,-1))>7,DAY(OFFSET(INDIRECT(ADDRESS(ROW(),COLUMN())),0,-1))<15),BY40+7,BY40+0)))","v":"2028-01-04"},null,"2027-01-05",null,{"$f":"_xlfn.IFS($CD$3=$CE$3,$CF$3,$CD$4=$CE$4,$CF$4,$CD$5=$CE$5,$CF$5,$CD$6=$CE$6,$CF$6,$CD$7=$CE$7,$CF$7,$CD$8=$CE$8,$CF$8,$CD$9=$CE$9,$CF$9,$CD$10=$CE$10,$CF$10,$CD$11=$CE$11,$CF$11,$CD$12=$CE$12,$CF$12,$CD$13=$CE$13,$CF$13,$CD$14=$CE$14,$CF$14,$CD$15=$CE$15,$CF$15,$CD$16=$CE$16,$CF$16,$CD$17=$CE$17,$CF$17,$CD$18=$CE$18,$CF$18,$CD$19=$CE$19,$CF$19,$CD$20=$CE$20,$CF$20,$CD$21=$CE$21,$CF$21,$CD$22=$CE$22,$CF$22,$CD$23=$CE$23,$CF$23,$CD$24=$CE$24,$CF$24,$CD$25=$CE$25,$CF$25,$CD$26=$CE$26,$CF$26,$CD$27=$CE$27,$CF$27,$CD$28=$CE$28,$CF$28,$CD$29=$CE$29,$CF$29,$CD$30=$CE$30,$CF$30,$CD$31=$CE$31,$CF$31,$CD$32=$CE$32,$CF$32,$CD$33=$CE$33,$CF$33,$CD$34=$CE$34,$CF$34,$CD$35=$CE$35,$CF$35,$CD$36=$CE$36,$CF$36,$CD$37=$CE$37,$CF$37,$CD$38=$CE$38,$CF$38,$CD$39=$CE$39,$CF$39)","v":"2028-08-10"},null,null,{"$f":"_xlfn.IFS($CG$3=$CH$3,$CI$3,$CG$4=$CH$4,$CI$4,$CG$5=$CH$5,$CI$5,$CG$6=$CH$6,$CI$6,$CG$7=$CH$7,$CI$7,$CG$8=$CH$8,$CI$8,$CG$9=$CH$9,$CI$9,$CG$10=$CH$10,$CI$10,$CG$11=$CH$11,$CI$11,$CG$12=$CH$12,$CI$12,$CG$13=$CH$13,$CI$13,$CG$14=$CH$14,$CI$14,$CG$15=$CH$15,$CI$15,$CG$16=$CH$16,$CI$16,$CG$17=$CH$17,$CI$17,$CG$18=$CH$18,$CI$18,$CG$19=$CH$19,$CI$19,$CG$20=$CH$20,$CI$20,$CG$21=$CH$21,$CI$21,$CG$22=$CH$22,$CI$22,$CG$23=$CH$23,$CI$23,$CG$24=$CH$24,$CI$24,$CG$25=$CH$25,$CI$25,$CG$26=$CH$26,$CI$26,$CG$27=$CH$27,$CI$27,$CG$28=$CH$28,$CI$28,$CG$29=$CH$29,$CI$29,$CG$30=$CH$30,$CI$30,$CG$31=$CH$31,$CI$31,$CG$32=$CH$32,$CI$32,$CG$33=$CH$33,$CI$33,$CG$34=$CH$34,$CI$34,$CG$35=$CH$35,$CI$35,$CG$36=$CH$36,$CI$36,$CG$37=$CH$37,$CI$37,$CG$38=$CH$38,$CI$38,$CG$39=$CH$39,$CI$39)","v":"2028-09-07"},"2028-01-06",{"$f":"IF(DAY(OFFSET(INDIRECT(ADDRESS(ROW(),COLUMN())),0,-1))<7,CH40+0,IF(DAY(OFFSET(INDIRECT(ADDRESS(ROW(),COLUMN())),0,-1))>7,CH40-7,CH40+0))","v":"2028-01-06"},{"$f":"_xlfn.IFS($CJ$3=$CK$3,$CL$3,$CJ$4=$CK$4,$CL$4,$CJ$5=$CK$5,$CL$5,$CJ$6=$CK$6,$CL$6,$CJ$7=$CK$7,$CL$7,$CJ$8=$CK$8,$CL$8,$CJ$9=$CK$9,$CL$9,$CJ$10=$CK$10,$CL$10,$CJ$11=$CK$11,$CL$11,$CJ$12=$CK$12,$CL$12,$CJ$13=$CK$13,$CL$13,$CJ$14=$CK$14,$CL$14,$CJ$15=$CK$15,$CL$15,$CJ$16=$CK$16,$CL$16,$CJ$17=$CK$17,$CL$17,$CJ$18=$CK$18,$CL$18,$CJ$19=$CK$19,$CL$19,$CJ$20=$CK$20,$CL$20,$CJ$21=$CK$21,$CL$21,$CJ$22=$CK$22,$CL$22,$CJ$23=$CK$23,$CL$23,$CJ$24=$CK$24,$CL$24,$CJ$25=$CK$25,$CL$25,$CJ$26=$CK$26,$CL$26,$CJ$27=$CK$27,$CL$27,$CJ$28=$CK$28,$CL$28,$CJ$29=$CK$29,$CL$29,$CJ$30=$CK$30,$CL$30,$CJ$31=$CK$31,$CL$31,$CJ$32=$CK$32,$CL$32,$CJ$33=$CK$33,$CL$33,$CJ$34=$CK$34,$CL$34,$CJ$35=$CK$35,$CL$35,$CJ$36=$CK$36,$CL$36,$CJ$37=$CK$37,$CL$37,$CJ$38=$CK$38,$CL$38,$CJ$39=$CK$39,$CL$39)","v":"2028-08-10"},"2027-01-07",null,{"$f":"_xlfn.IFS($CM$3=$CN$3,$CO$3,$CM$4=$CN$4,$CO$4,$CM$5=$CN$5,$CO$5,$CM$6=$CN$6,$CO$6,$CM$7=$CN$7,$CO$7,$CM$8=$CN$8,$CO$8,$CM$9=$CN$9,$CO$9,$CM$10=$CN$10,$CO$10,$CM$11=$CN$11,$CO$11,$CM$12=$CN$12,$CO$12,$CM$13=$CN$13,$CO$13,$CM$14=$CN$14,$CO$14,$CM$15=$CN$15,$CO$15,$CM$16=$CN$16,$CO$16,$CM$17=$CN$17,$CO$17,$CM$18=$CN$18,$CO$18,$CM$19=$CN$19,$CO$19,$CM$20=$CN$20,$CO$20,$CM$21=$CN$21,$CO$21,$CM$22=$CN$22,$CO$22,$CM$23=$CN$23,$CO$23,$CM$24=$CN$24,$CO$24,$CM$25=$CN$25,$CO$25,$CM$26=$CN$26,$CO$26,$CM$27=$CN$27,$CO$27,$CM$28=$CN$28,$CO$28,$CM$29=$CN$29,$CO$29,$CM$30=$CN$30,$CO$30,$CM$31=$CN$31,$CO$31,$CM$32=$CN$32,$CO$32,$CM$33=$CN$33,$CO$33,$CM$34=$CN$34,$CO$34,$CM$35=$CN$35,$CO$35,$CM$36=$CN$36,$CO$36,$CM$37=$CN$37,$CO$37,$CM$38=$CN$38,$CO$38,$CM$39=$CN$39,$CO$39)","v":"2028-08-15"},"2028-01-11",{"$f":"IF(DAY(OFFSET(INDIRECT(ADDRESS(ROW(),COLUMN())),0,-1))<8,CN40+7,CN40+0)","v":"2028-01-11"},{"$f":"_xlfn.IFS($CP$3=$CQ$3,$CR$3,$CP$4=$CQ$4,$CR$4,$CP$5=$CQ$5,$CR$5,$CP$6=$CQ$6,$CR$6,$CP$7=$CQ$7,$CR$7,$CP$8=$CQ$8,$CR$8,$CP$9=$CQ$9,$CR$9,$CP$10=$CQ$10,$CR$10,$CP$11=$CQ$11,$CR$11,$CP$12=$CQ$12,$CR$12,$CP$13=$CQ$13,$CR$13,$CP$14=$CQ$14,$CR$14,$CP$15=$CQ$15,$CR$15,$CP$16=$CQ$16,$CR$16,$CP$17=$CQ$17,$CR$17,$CP$18=$CQ$18,$CR$18,$CP$19=$CQ$19,$CR$19,$CP$20=$CQ$20,$CR$20,$CP$21=$CQ$21,$CR$21,$CP$22=$CQ$22,$CR$22,$CP$23=$CQ$23,$CR$23,$CP$24=$CQ$24,$CR$24,$CP$25=$CQ$25,$CR$25,$CP$26=$CQ$26,$CR$26,$CP$27=$CQ$27,$CR$27,$CP$28=$CQ$28,$CR$28,$CP$29=$CQ$29,$CR$29,$CP$30=$CQ$30,$CR$30,$CP$31=$CQ$31,$CR$31,$CP$32=$CQ$32,$CR$32,$CP$33=$CQ$33,$CR$33,$CP$34=$CQ$34,$CR$34,$CP$35=$CQ$35,$CR$35,$CP$36=$CQ$36,$CR$36,$CP$37=$CQ$37,$CR$37,$CP$38=$CQ$38,$CR$38,$CP$39=$CQ$39,$CR$39)","v":"2028-09-04"},"2028-01-03",{"$f":"IF(DAY(OFFSET(INDIRECT(ADDRESS(ROW(),COLUMN())),0,-1))<7,CQ40+0,IF(DAY(OFFSET(INDIRECT(ADDRESS(ROW(),COLUMN())),0,-1))>7,CQ40-7,CQ40+0))","v":"2028-01-03"},{"$f":"_xlfn.IFS($CS$3=$CT$3,$CU$3,$CS$4=$CT$4,$CU$4,$CS$5=$CT$5,$CU$5,$CS$6=$CT$6,$CU$6,$CS$7=$CT$7,$CU$7,$CS$8=$CT$8,$CU$8,$CS$9=$CT$9,$CU$9,$CS$10=$CT$10,$CU$10,$CS$11=$CT$11,$CU$11,$CS$12=$CT$12,$CU$12,$CS$13=$CT$13,$CU$13,$CS$14=$CT$14,$CU$14,$CS$15=$CT$15,$CU$15,$CS$16=$CT$16,$CU$16,$CS$17=$CT$17,$CU$17,$CS$18=$CT$18,$CU$18,$CS$19=$CT$19,$CU$19,$CS$20=$CT$20,$CU$20,$CS$21=$CT$21,$CU$21,$CS$22=$CT$22,$CU$22,$CS$23=$CT$23,$CU$23,$CS$24=$CT$24,$CU$24,$CS$25=$CT$25,$CU$25,$CS$26=$CT$26,$CU$26,$CS$27=$CT$27,$CU$27,$CS$28=$CT$28,$CU$28,$CS$29=$CT$29,$CU$29,$CS$30=$CT$30,$CU$30,$CS$31=$CT$31,$CU$31,$CS$32=$CT$32,$CU$32,$CS$33=$CT$33,$CU$33,$CS$34=$CT$34,$CU$34,$CS$35=$CT$35,$CU$35,$CS$36=$CT$36,$CU$36,$CS$37=$CT$37,$CU$37,$CS$38=$CT$38,$CU$38,$CS$39=$CT$39,$CU$39)","v":"2028-08-10"},"2028-01-03",{"$f":"IF(DAY(OFFSET(INDIRECT(ADDRESS(ROW(),COLUMN())),0,-1))<7,CT40+0,IF(DAY(OFFSET(INDIRECT(ADDRESS(ROW(),COLUMN())),0,-1))>7,CT40-7,CT40+0))+3","v":"2028-01-06"},{"$f":"_xlfn.IFS($CV$3=$CW$3,$CX$3,$CV$4=$CW$4,$CX$4,$CV$5=$CW$5,$CX$5,$CV$6=$CW$6,$CX$6,$CV$7=$CW$7,$CX$7,$CV$8=$CW$8,$CX$8,$CV$9=$CW$9,$CX$9,$CV$10=$CW$10,$CX$10,$CV$11=$CW$11,$CX$11,$CV$12=$CW$12,$CX$12,$CV$13=$CW$13,$CX$13,$CV$14=$CW$14,$CX$14,$CV$15=$CW$15,$CX$15,$CV$16=$CW$16,$CX$16,$CV$17=$CW$17,$CX$17,$CV$18=$CW$18,$CX$18,$CV$19=$CW$19,$CX$19,$CV$20=$CW$20,$CX$20,$CV$21=$CW$21,$CX$21,$CV$22=$CW$22,$CX$22,$CV$23=$CW$23,$CX$23,$CV$24=$CW$24,$CX$24,$CV$25=$CW$25,$CX$25,$CV$26=$CW$26,$CX$26,$CV$27=$CW$27,$CX$27,$CV$28=$CW$28,$CX$28,$CV$29=$CW$29,$CX$29,$CV$30=$CW$30,$CX$30,$CV$31=$CW$31,$CX$31,$CV$32=$CW$32,$CX$32,$CV$33=$CW$33,$CX$33,$CV$34=$CW$34,$CX$34,$CV$35=$CW$35,$CX$35,$CV$36=$CW$36,$CX$36,$CV$37=$CW$37,$CX$37,$CV$38=$CW$38,$CX$38,$CV$39=$CW$39,$CX$39)","v":"2028-07-10"},"2028-01-03",{"$f":"IF(DAY(OFFSET(INDIRECT(ADDRESS(ROW(),COLUMN())),0,-1))<8,CW40+7,CW40+0)","v":"2028-01-10"},{"$f":"_xlfn.IFS($CY$3=$CZ$3,$DA$3,$CY$4=$CZ$4,$DA$4,$CY$5=$CZ$5,$DA$5,$CY$6=$CZ$6,$DA$6,$CY$7=$CZ$7,$DA$7,$CY$8=$CZ$8,$DA$8,$CY$9=$CZ$9,$DA$9,$CY$10=$CZ$10,$DA$10,$CY$11=$CZ$11,$DA$11,$CY$12=$CZ$12,$DA$12,$CY$13=$CZ$13,$DA$13,$CY$14=$CZ$14,$DA$14,$CY$15=$CZ$15,$DA$15,$CY$16=$CZ$16,$DA$16,$CY$17=$CZ$17,$DA$17,$CY$18=$CZ$18,$DA$18,$CY$19=$CZ$19,$DA$19,$CY$20=$CZ$20,$DA$20,$CY$21=$CZ$21,$DA$21,$CY$22=$CZ$22,$DA$22,$CY$23=$CZ$23,$DA$23,$CY$24=$CZ$24,$DA$24,$CY$25=$CZ$25,$DA$25,$CY$26=$CZ$26,$DA$26,$CY$27=$CZ$27,$DA$27,$CY$28=$CZ$28,$DA$28,$CY$29=$CZ$29,$DA$29,$CY$30=$CZ$30,$DA$30,$CY$31=$CZ$31,$DA$31,$CY$32=$CZ$32,$DA$32,$CY$33=$CZ$33,$DA$33,$CY$34=$CZ$34,$DA$34,$CY$35=$CZ$35,$DA$35,$CY$36=$CZ$36,$DA$36,$CY$37=$CZ$37,$DA$37,$CY$38=$CZ$38,$DA$38,$CY$39=$CZ$39,$DA$39)","v":"2028-04-17"},"2028-01-17",{"$f":"IF(DAY(OFFSET(INDIRECT(ADDRESS(ROW(),COLUMN())),0,-1))<15,CZ40+7,IF(DAY(OFFSET(INDIRECT(ADDRESS(ROW(),COLUMN())),0,-1))>21,CZ40-7,CZ40+0))","v":"2028-01-17"},{"$f":"IF(AND(N$8>=DC39,N$8<=DC40),DC40,\"X\")","v":"X"},"2029-06-05","2029-07-25"]
["2029-06-11","2029-09-18","2029-10-16",{"$f":"IF(DAY(OFFSET(INDIRECT(ADDRESS(ROW(),COLUMN())),0,-1))<15,C41+7,IF(DAY(OFFSET(INDIRECT(ADDRESS(ROW(),COLUMN())),0,-1))>21,C41-7,C41+0))","v":"2029-10-16"},"Tim's Time:",14,{"$f":"I41","v":"Charlotte Water"},{"$f":"BL40","v":"2028-08-15"},"Charlotte Water",0,50,50,null,"2028-01-17",{"$f":"IF(DAY(OFFSET(INDIRECT(ADDRESS(ROW(),COLUMN())),0,-1))>21,N41+7,IF(DAY(OFFSET(INDIRECT(ADDRESS(ROW(),COLUMN())),0,-1))<7,N41+0,IF(AND(DAY(OFFSET(INDIRECT(ADDRESS(ROW(),COLUMN())),0,-1))>7,DAY(OFFSET(INDIRECT(ADDRESS(ROW(),COLUMN())),0,-1))<15),N41+7,N41+0)))","v":"2028-01-17"},null,"2028-01-18",{"$f":"IF(DAY(OFFSET(INDIRECT(ADDRESS(ROW(),COLUMN())),0,-1))>21,Q41+7,IF(DAY(OFFSET(INDIRECT(ADDRESS(ROW(),COLUMN())),0,-1))<7,Q41+0,IF(AND(DAY(OFFSET(INDIRECT(ADDRESS(ROW(),COLUMN())),0,-1))>7,DAY(OFFSET(INDIRECT(ADDRESS(ROW(),COLUMN())),0,-1))<15),Q41+7,Q41+0)))","v":"2028-01-18"},null,"2028-02-08",{"$f":"IF(DAY(OFFSET(INDIRECT(ADDRESS(ROW(),COLUMN())),0,-1))<8,T41+7,T41+0)","v":"2028-02-08"},null,"2028-01-17",{"$f":"IF(DAY(OFFSET(INDIRECT(ADDRESS(ROW(),COLUMN())),0,-1))>21,W41+7,IF(DAY(OFFSET(INDIRECT(ADDRESS(ROW(),COLUMN())),0,-1))<7,W41+0,IF(AND(DAY(OFFSET(INDIRECT(ADDRESS(ROW(),COLUMN())),0,-1))>7,DAY(OFFSET(INDIRECT(ADDRESS(ROW(),COLUMN())),0,-1))<15),W41+7,W41+0)))","v":"2028-01-17"},null,"2028-02-10",{"$f":"IF(DAY(OFFSET(INDIRECT(ADDRESS(ROW(),COLUMN())),0,-1))=15,Z41-7,Z41+0)","v":"2028-02-10"},null,null,null,null,null,null,null,null,null,null,null,null,null,null,null,null,"2028-02-08",{"$f":"IF(DAY(OFFSET(INDIRECT(ADDRESS(ROW(),COLUMN())),0,-1))<8,AR41+7,AR41+0)","v":"2028-02-08"},null,"2028-01-17",{"$f":"IF(DAY(OFFSET(INDIRECT(ADDRESS(ROW(),COLUMN())),0,-1))>21,AU41+7,IF(DAY(OFFSET(INDIRECT(ADDRESS(ROW(),COLUMN())),0,-1))<7,AU41+0,IF(AND(DAY(OFFSET(INDIRECT(ADDRESS(ROW(),COLUMN())),0,-1))>7,DAY(OFFSET(INDIRECT(ADDRESS(ROW(),COLUMN())),0,-1))<15),AU41+7,AU41+0)))","v":"2028-01-17"},null,"2028-02-15",{"$f":"IF(DAY(OFFSET(INDIRECT(ADDRESS(ROW(),COLUMN())),0,-1))<16,AX41+7,AX41+0)","v":"2028-02-22"},null,"2028-01-13",{"$f":"IF(DAY(OFFSET(INDIRECT(ADDRESS(ROW(),COLUMN())),0,-1))>21,BA41+7,IF(DAY(OFFSET(INDIRECT(ADDRESS(ROW(),COLUMN())),0,-1))<7,BA41+0,IF(AND(DAY(OFFSET(INDIRECT(ADDRESS(ROW(),COLUMN())),0,-1))>7,DAY(OFFSET(INDIRECT(ADDRESS(ROW(),COLUMN())),0,-1))<15),BA41+7,BA41+0)))","v":"2028-01-20"},null,"2028-01-18",{"$f":"IF(DAY(OFFSET(INDIRECT(ADDRESS(ROW(),COLUMN())),0,-1))>21,BD41+7,IF(DAY(OFFSET(INDIRECT(ADDRESS(ROW(),COLUMN())),0,-1))<7,BD41+0,IF(AND(DAY(OFFSET(INDIRECT(ADDRESS(ROW(),COLUMN())),0,-1))>7,DAY(OFFSET(INDIRECT(ADDRESS(ROW(),COLUMN())),0,-1))<15),BD41+7,BD41+0)))","v":"2028-01-18"},null,"2028-01-18",null,null,"2028-07-20",{"$f":"IF(DAY(OFFSET(INDIRECT(ADDRESS(ROW(),COLUMN())),0,-1))<15,BJ41+7,IF(DAY(OFFSET(INDIRECT(ADDRESS(ROW(),COLUMN())),0,-1))>21,BJ41-7,BJ41+0))","v":"2028-07-20"},null,"2028-02-22",{"$f":"IF(DAY(OFFSET(INDIRECT(ADDRESS(ROW(),COLUMN())),0,-1))<15,BM41+7,IF(DAY(OFFSET(INDIRECT(ADDRESS(ROW(),COLUMN())),0,-1))>21,BM41-7,BM41+0))","v":"2028-02-15"},null,"2028-01-25",{"$f":"IF(DAY(OFFSET(INDIRECT(ADDRESS(ROW(),COLUMN())),0,-1))<21,BP41+7,IF(DAY(OFFSET(INDIRECT(ADDRESS(ROW(),COLUMN())),0,-1))>28,BP41-7,BP41+0))","v":"2028-01-25"},"X","2028-11-29","2029-01-18",null,"2028-02-22",{"$f":"IF(DAY(OFFSET(INDIRECT(ADDRESS(ROW(),COLUMN())),0,-1))<15,BV41+7,IF(DAY(OFFSET(INDIRECT(ADDRESS(ROW(),COLUMN())),0,-1))>21,BV41-7,BV41+0))","v":"2028-02-15"},null,"2028-01-18",{"$f":"IF(DAY(OFFSET(INDIRECT(ADDRESS(ROW(),COLUMN())),0,-1))>21,BY41+7,IF(DAY(OFFSET(INDIRECT(ADDRESS(ROW(),COLUMN())),0,-1))<7,BY41+0,IF(AND(DAY(OFFSET(INDIRECT(ADDRESS(ROW(),COLUMN())),0,-1))>7,DAY(OFFSET(INDIRECT(ADDRESS(ROW(),COLUMN())),0,-1))<15),BY41+7,BY41+0)))","v":"2028-01-18"},null,"2027-01-19",null,null,null,null,null,"2028-02-03",{"$f":"IF(DAY(OFFSET(INDIRECT(ADDRESS(ROW(),COLUMN())),0,-1))<7,CH41+0,IF(DAY(OFFSET(INDIRECT(ADDRESS(ROW(),COLUMN())),0,-1))>7,CH41-7,CH41+0))","v":"2028-02-03"},null,"2027-02-04",null,null,"2028-02-08",{"$f":"IF(DAY(OFFSET(INDIRECT(ADDRESS(ROW(),COLUMN())),0,-1))<8,CN41+7,CN41+0)","v":"2028-02-08"},null,"2028-02-07",{"$f":"IF(DAY(OFFSET(INDIRECT(ADDRESS(ROW(),COLUMN())),0,-1))<7,CQ41+0,IF(DAY(OFFSET(INDIRECT(ADDRESS(ROW(),COLUMN())),0,-1))>7,CQ41-7,CQ41+0))","v":"2028-02-07"},null,"2028-02-07",{"$f":"IF(DAY(OFFSET(INDIRECT(ADDRESS(ROW(),COLUMN())),0,-1))<7,CT41+0,IF(DAY(OFFSET(INDIRECT(ADDRESS(ROW(),COLUMN())),0,-1))>7,CT41-7,CT41+0))+3","v":"2028-02-10"},null,"2028-02-07",{"$f":"IF(DAY(OFFSET(INDIRECT(ADDRESS(ROW(),COLUMN())),0,-1))<8,CW41+7,CW41+0)","v":"2028-02-14"},null,"2028-02-21",{"$f":"IF(DAY(OFFSET(INDIRECT(ADDRESS(ROW(),COLUMN())),0,-1))<15,CZ41+7,IF(DAY(OFFSET(INDIRECT(ADDRESS(ROW(),COLUMN())),0,-1))>21,CZ41-7,CZ41+0))","v":"2028-02-21"},"X","2029-06-18","2029-08-07"]
["2029-07-09","2029-10-16","2029-11-20",{"$f":"IF(DAY(OFFSET(INDIRECT(ADDRESS(ROW(),COLUMN())),0,-1))<15,C42+7,IF(DAY(OFFSET(INDIRECT(ADDRESS(ROW(),COLUMN())),0,-1))>21,C42-7,C42+0))","v":"2029-11-20"},"Exhibit Review Time:",45,{"$f":"I42","v":"Union County"},{"$f":"M40","v":"2028-08-21"},"Union County",30,21,14,null,"2028-01-31",{"$f":"IF(DAY(OFFSET(INDIRECT(ADDRESS(ROW(),COLUMN())),0,-1))>21,N42+7,IF(DAY(OFFSET(INDIRECT(ADDRESS(ROW(),COLUMN())),0,-1))<7,N42+0,IF(AND(DAY(OFFSET(INDIRECT(ADDRESS(ROW(),COLUMN())),0,-1))>7,DAY(OFFSET(INDIRECT(ADDRESS(ROW(),COLUMN())),0,-1))<15),N42+7,N42+0)))","v":"2028-02-07"},null,"2028-02-01",{"$f":"IF(DAY(OFFSET(INDIRECT(ADDRESS(ROW(),COLUMN())),0,-1))>21,Q42+7,IF(DAY(OFFSET(INDIRECT(ADDRESS(ROW(),COLUMN())),0,-1))<7,Q42+0,IF(AND(DAY(OFFSET(INDIRECT(ADDRESS(ROW(),COLUMN())),0,-1))>7,DAY(OFFSET(INDIRECT(ADDRESS(ROW(),COLUMN())),0,-1))<15),Q42+7,Q42+0)))","v":"2028-02-01"},null,"2028-03-07",{"$f":"IF(DAY(OFFSET(INDIRECT(ADDRESS(ROW(),COLUMN())),0,-1))<8,T42+7,T42+0)","v":"2028-03-14"},null,"2028-01-31",{"$f":"IF(DAY(OFFSET(INDIRECT(ADDRESS(ROW(),COLUMN())),0,-1))>21,W42+7,IF(DAY(OFFSET(INDIRECT(ADDRESS(ROW(),COLUMN())),0,-1))<7,W42+0,IF(AND(DAY(OFFSET(INDIRECT(ADDRESS(ROW(),COLUMN())),0,-1))>7,DAY(OFFSET(INDIRECT(ADDRESS(ROW(),COLUMN())),0,-1))<15),W42+7,W42+0)))","v":"2028-02-07"},null,"2028-03-09",{"$f":"IF(DAY(OFFSET(INDIRECT(ADDRESS(ROW(),COLUMN())),0,-1))=15,Z42-7,Z42+0)","v":"2028-03-09"},null,null,null,null,null,null,null,null,null,null,null,null,null,null,null,null,"2028-03-07",{"$f":"IF(DAY(OFFSET(INDIRECT(ADDRESS(ROW(),COLUMN())),0,-1))<8,AR42+7,AR42+0)","v":"2028-03-14"},null,"2028-01-31",{"$f":"IF(DAY(OFFSET(INDIRECT(ADDRESS(ROW(),COLUMN())),0,-1))>21,AU42+7,IF(DAY(OFFSET(INDIRECT(ADDRESS(ROW(),COLUMN())),0,-1))<7,AU42+0,IF(AND(DAY(OFFSET(INDIRECT(ADDRESS(ROW(),COLUMN())),0,-1))>7,DAY(OFFSET(INDIRECT(ADDRESS(ROW(),COLUMN())),0,-1))<15),AU42+7,AU42+0)))","v":"2028-02-07"},null,"2028-03-21",{"$f":"IF(DAY(OFFSET(INDIRECT(ADDRESS(ROW(),COLUMN())),0,-1))<16,AX42+7,AX42+0)","v":"2028-03-21"},null,"2028-02-03",{"$f":"IF(DAY(OFFSET(INDIRECT(ADDRESS(ROW(),COLUMN())),0,-1))>21,BA42+7,IF(DAY(OFFSET(INDIRECT(ADDRESS(ROW(),COLUMN())),0,-1))<7,BA42+0,IF(AND(DAY(OFFSET(INDIRECT(ADDRESS(ROW(),COLUMN())),0,-1))>7,DAY(OFFSET(INDIRECT(ADDRESS(ROW(),COLUMN())),0,-1))<15),BA42+7,BA42+0)))","v":"2028-02-03"},null,"2028-01-31",{"$f":"IF(DAY(OFFSET(INDIRECT(ADDRESS(ROW(),COLUMN())),0,-1))>21,BD42+7,IF(DAY(OFFSET(INDIRECT(ADDRESS(ROW(),COLUMN())),0,-1))<7,BD42+0,IF(AND(DAY(OFFSET(INDIRECT(ADDRESS(ROW(),COLUMN())),0,-1))>7,DAY(OFFSET(INDIRECT(ADDRESS(ROW(),COLUMN())),0,-1))<15),BD42+7,BD42+0)))","v":"2028-02-07"},null,"2028-02-01",null,null,"2028-08-17",{"$f":"IF(DAY(OFFSET(INDIRECT(ADDRESS(ROW(),COLUMN())),0,-1))<15,BJ42+7,IF(DAY(OFFSET(INDIRECT(ADDRESS(ROW(),COLUMN())),0,-1))>21,BJ42-7,BJ42+0))","v":"2028-08-17"},null,"2028-03-21",{"$f":"IF(DAY(OFFSET(INDIRECT(ADDRESS(ROW(),COLUMN())),0,-1))<15,BM42+7,IF(DAY(OFFSET(INDIRECT(ADDRESS(ROW(),COLUMN())),0,-1))>21,BM42-7,BM42+0))","v":"2028-03-21"},null,"2028-02-29",{"$f":"IF(DAY(OFFSET(INDIRECT(ADDRESS(ROW(),COLUMN())),0,-1))<21,BP42+7,IF(DAY(OFFSET(INDIRECT(ADDRESS(ROW(),COLUMN())),0,-1))>28,BP42-7,BP42+0))","v":"2028-02-22"},"X","2028-12-17","2029-02-05",null,"2028-03-21",{"$f":"IF(DAY(OFFSET(INDIRECT(ADDRESS(ROW(),COLUMN())),0,-1))<15,BV42+7,IF(DAY(OFFSET(INDIRECT(ADDRESS(ROW(),COLUMN())),0,-1))>21,BV42-7,BV42+0))","v":"2028-03-21"},null,"2028-02-01",{"$f":"IF(DAY(OFFSET(INDIRECT(ADDRESS(ROW(),COLUMN())),0,-1))>21,BY42+7,IF(DAY(OFFSET(INDIRECT(ADDRESS(ROW(),COLUMN())),0,-1))<7,BY42+0,IF(AND(DAY(OFFSET(INDIRECT(ADDRESS(ROW(),COLUMN())),0,-1))>7,DAY(OFFSET(INDIRECT(ADDRESS(ROW(),COLUMN())),0,-1))<15),BY42+7,BY42+0)))","v":"2028-02-01"},null,"2027-02-02",null,null,null,null,null,"2028-03-02",{"$f":"IF(DAY(OFFSET(INDIRECT(ADDRESS(ROW(),COLUMN())),0,-1))<7,CH42+0,IF(DAY(OFFSET(INDIRECT(ADDRESS(ROW(),COLUMN())),0,-1))>7,CH42-7,CH42+0))","v":"2028-03-02"},null,"2027-03-04",null,null,"2028-03-07",{"$f":"IF(DAY(OFFSET(INDIRECT(ADDRESS(ROW(),COLUMN())),0,-1))<8,CN42+7,CN42+0)","v":"2028-03-14"},null,"2028-03-06",{"$f":"IF(DAY(OFFSET(INDIRECT(ADDRESS(ROW(),COLUMN())),0,-1))<7,CQ42+0,IF(DAY(OFFSET(INDIRECT(ADDRESS(ROW(),COLUMN())),0,-1))>7,CQ42-7,CQ42+0))","v":"2028-03-06"},null,"2028-03-06",{"$f":"IF(DAY(OFFSET(INDIRECT(ADDRESS(ROW(),COLUMN())),0,-1))<7,CT42+0,IF(DAY(OFFSET(INDIRECT(ADDRESS(ROW(),COLUMN())),0,-1))>7,CT42-7,CT42+0))+3","v":"2028-03-09"},null,"2028-03-06",{"$f":"IF(DAY(OFFSET(INDIRECT(ADDRESS(ROW(),COLUMN())),0,-1))<8,CW42+7,CW42+0)","v":"2028-03-13"},null,"2028-03-20",{"$f":"IF(DAY(OFFSET(INDIRECT(ADDRESS(ROW(),COLUMN())),0,-1))<15,CZ42+7,IF(DAY(OFFSET(INDIRECT(ADDRESS(ROW(),COLUMN())),0,-1))>21,CZ42-7,CZ42+0))","v":"2028-03-20"},"X","2029-07-03","2029-08-22"]
["2029-08-13","2029-11-20","2029-12-18",{"$f":"IF(DAY(OFFSET(INDIRECT(ADDRESS(ROW(),COLUMN())),0,-1))<15,C43+7,IF(DAY(OFFSET(INDIRECT(ADDRESS(ROW(),COLUMN())),0,-1))>21,C43-7,C43+0))","v":"2029-12-18"},"Construciton Auth:",28,"Anson County",{"$f":"M40","v":"2028-08-21"},"Anson County",null,null,null,null,"2028-02-14",{"$f":"IF(DAY(OFFSET(INDIRECT(ADDRESS(ROW(),COLUMN())),0,-1))>21,N43+7,IF(DAY(OFFSET(INDIRECT(ADDRESS(ROW(),COLUMN())),0,-1))<7,N43+0,IF(AND(DAY(OFFSET(INDIRECT(ADDRESS(ROW(),COLUMN())),0,-1))>7,DAY(OFFSET(INDIRECT(ADDRESS(ROW(),COLUMN())),0,-1))<15),N43+7,N43+0)))","v":"2028-02-21"},null,"2028-02-15",{"$f":"IF(DAY(OFFSET(INDIRECT(ADDRESS(ROW(),COLUMN())),0,-1))>21,Q43+7,IF(DAY(OFFSET(INDIRECT(ADDRESS(ROW(),COLUMN())),0,-1))<7,Q43+0,IF(AND(DAY(OFFSET(INDIRECT(ADDRESS(ROW(),COLUMN())),0,-1))>7,DAY(OFFSET(INDIRECT(ADDRESS(ROW(),COLUMN())),0,-1))<15),Q43+7,Q43+0)))","v":"2028-02-15"},null,"2028-04-11",{"$f":"IF(DAY(OFFSET(INDIRECT(ADDRESS(ROW(),COLUMN())),0,-1))<8,T43+7,T43+0)","v":"2028-04-11"},null,"2028-02-14",{"$f":"IF(DAY(OFFSET(INDIRECT(ADDRESS(ROW(),COLUMN())),0,-1))>21,W43+7,IF(DAY(OFFSET(INDIRECT(ADDRESS(ROW(),COLUMN())),0,-1))<7,W43+0,IF(AND(DAY(OFFSET(INDIRECT(ADDRESS(ROW(),COLUMN())),0,-1))>7,DAY(OFFSET(INDIRECT(ADDRESS(ROW(),COLUMN())),0,-1))<15),W43+7,W43+0)))","v":"2028-02-21"},null,"2028-04-13",{"$f":"IF(DAY(OFFSET(INDIRECT(ADDRESS(ROW(),COLUMN())),0,-1))=15,Z43-7,Z43+0)","v":"2028-04-13"},null,null,null,null,null,null,null,null,null,null,null,null,null,null,null,null,"2028-04-11",{"$f":"IF(DAY(OFFSET(INDIRECT(ADDRESS(ROW(),COLUMN())),0,-1))<8,AR43+7,AR43+0)","v":"2028-04-11"},null,"2028-02-14",{"$f":"IF(DAY(OFFSET(INDIRECT(ADDRESS(ROW(),COLUMN())),0,-1))>21,AU43+7,IF(DAY(OFFSET(INDIRECT(ADDRESS(ROW(),COLUMN())),0,-1))<7,AU43+0,IF(AND(DAY(OFFSET(INDIRECT(ADDRESS(ROW(),COLUMN())),0,-1))>7,DAY(OFFSET(INDIRECT(ADDRESS(ROW(),COLUMN())),0,-1))<15),AU43+7,AU43+0)))","v":"2028-02-21"},null,"2028-04-18",{"$f":"IF(DAY(OFFSET(INDIRECT(ADDRESS(ROW(),COLUMN())),0,-1))<16,AX43+7,AX43+0)","v":"2028-04-18"},null,"2028-02-17",{"$f":"IF(DAY(OFFSET(INDIRECT(ADDRESS(ROW(),COLUMN())),0,-1))>21,BA43+7,IF(DAY(OFFSET(INDIRECT(ADDRESS(ROW(),COLUMN())),0,-1))<7,BA43+0,IF(AND(DAY(OFFSET(INDIRECT(ADDRESS(ROW(),COLUMN())),0,-1))>7,DAY(OFFSET(INDIRECT(ADDRESS(ROW(),COLUMN())),0,-1))<15),BA43+7,BA43+0)))","v":"2028-02-17"},null,"2028-02-15",{"$f":"IF(DAY(OFFSET(INDIRECT(ADDRESS(ROW(),COLUMN())),0,-1))>21,BD43+7,IF(DAY(OFFSET(INDIRECT(ADDRESS(ROW(),COLUMN())),0,-1))<7,BD43+0,IF(AND(DAY(OFFSET(INDIRECT(ADDRESS(ROW(),COLUMN())),0,-1))>7,DAY(OFFSET(INDIRECT(ADDRESS(ROW(),COLUMN())),0,-1))<15),BD43+7,BD43+0)))","v":"2028-02-15"},null,"2028-02-15",null,null,"2028-09-21",{"$f":"IF(DAY(OFFSET(INDIRECT(ADDRESS(ROW(),COLUMN())),0,-1))<15,BJ43+7,IF(DAY(OFFSET(INDIRECT(ADDRESS(ROW(),COLUMN())),0,-1))>21,BJ43-7,BJ43+0))","v":"2028-09-21"},null,"2028-04-18",{"$f":"IF(DAY(OFFSET(INDIRECT(ADDRESS(ROW(),COLUMN())),0,-1))<15,BM43+7,IF(DAY(OFFSET(INDIRECT(ADDRESS(ROW(),COLUMN())),0,-1))>21,BM43-7,BM43+0))","v":"2028-04-18"},null,"2028-03-28",{"$f":"IF(DAY(OFFSET(INDIRECT(ADDRESS(ROW(),COLUMN())),0,-1))<21,BP43+7,IF(DAY(OFFSET(INDIRECT(ADDRESS(ROW(),COLUMN())),0,-1))>28,BP43-7,BP43+0))","v":"2028-03-28"},"X","2029-01-02","2029-02-21",null,"2028-04-18",{"$f":"IF(DAY(OFFSET(INDIRECT(ADDRESS(ROW(),COLUMN())),0,-1))<15,BV43+7,IF(DAY(OFFSET(INDIRECT(ADDRESS(ROW(),COLUMN())),0,-1))>21,BV43-7,BV43+0))","v":"2028-04-18"},null,"2028-02-15",{"$f":"IF(DAY(OFFSET(INDIRECT(ADDRESS(ROW(),COLUMN())),0,-1))>21,BY43+7,IF(DAY(OFFSET(INDIRECT(ADDRESS(ROW(),COLUMN())),0,-1))<7,BY43+0,IF(AND(DAY(OFFSET(INDIRECT(ADDRESS(ROW(),COLUMN())),0,-1))>7,DAY(OFFSET(INDIRECT(ADDRESS(ROW(),COLUMN())),0,-1))<15),BY43+7,BY43+0)))","v":"2028-02-15"},null,"2027-02-16",null,null,null,null,null,"2028-04-06",{"$f":"IF(DAY(OFFSET(INDIRECT(ADDRESS(ROW(),COLUMN())),0,-1))<7,CH43+0,IF(DAY(OFFSET(INDIRECT(ADDRESS(ROW(),COLUMN())),0,-1))>7,CH43-7,CH43+0))","v":"2028-04-06"},null,"2027-04-08",null,null,"2028-04-11",{"$f":"IF(DAY(OFFSET(INDIRECT(ADDRESS(ROW(),COLUMN())),0,-1))<8,CN43+7,CN43+0)","v":"2028-04-11"},null,"2028-04-03",{"$f":"IF(DAY(OFFSET(INDIRECT(ADDRESS(ROW(),COLUMN())),0,-1))<7,CQ43+0,IF(DAY(OFFSET(INDIRECT(ADDRESS(ROW(),COLUMN())),0,-1))>7,CQ43-7,CQ43+0))","v":"2028-04-03"},null,"2028-04-03",{"$f":"IF(DAY(OFFSET(INDIRECT(ADDRESS(ROW(),COLUMN())),0,-1))<7,CT43+0,IF(DAY(OFFSET(INDIRECT(ADDRESS(ROW(),COLUMN())),0,-1))>7,CT43-7,CT43+0))+3","v":"2028-04-06"},null,"2028-04-03",{"$f":"IF(DAY(OFFSET(INDIRECT(ADDRESS(ROW(),COLUMN())),0,-1))<8,CW43+7,CW43+0)","v":"2028-04-10"},null,"2028-04-17",{"$f":"IF(DAY(OFFSET(INDIRECT(ADDRESS(ROW(),COLUMN())),0,-1))<15,CZ43+7,IF(DAY(OFFSET(INDIRECT(ADDRESS(ROW(),COLUMN())),0,-1))>21,CZ43-7,CZ43+0))","v":"2028-04-17"},"X","2029-07-16","2029-09-04"]
["2029-09-10","2029-12-18","2030-01-22",{"$f":"IF(DAY(OFFSET(INDIRECT(ADDRESS(ROW(),COLUMN())),0,-1))<15,C44+7,IF(DAY(OFFSET(INDIRECT(ADDRESS(ROW(),COLUMN())),0,-1))>21,C44-7,C44+0))","v":"2030-01-15"},"BOT Cutoff:",120,"Stanly County",{"$f":"S40","v":"2028-08-15"},"Stanly County",null,null,null,null,"2028-02-28",{"$f":"IF(DAY(OFFSET(INDIRECT(ADDRESS(ROW(),COLUMN())),0,-1))>21,N44+7,IF(DAY(OFFSET(INDIRECT(ADDRESS(ROW(),COLUMN())),0,-1))<7,N44+0,IF(AND(DAY(OFFSET(INDIRECT(ADDRESS(ROW(),COLUMN())),0,-1))>7,DAY(OFFSET(INDIRECT(ADDRESS(ROW(),COLUMN())),0,-1))<15),N44+7,N44+0)))","v":"2028-03-06"},null,"2028-03-07",{"$f":"IF(DAY(OFFSET(INDIRECT(ADDRESS(ROW(),COLUMN())),0,-1))>21,Q44+7,IF(DAY(OFFSET(INDIRECT(ADDRESS(ROW(),COLUMN())),0,-1))<7,Q44+0,IF(AND(DAY(OFFSET(INDIRECT(ADDRESS(ROW(),COLUMN())),0,-1))>7,DAY(OFFSET(INDIRECT(ADDRESS(ROW(),COLUMN())),0,-1))<15),Q44+7,Q44+0)))","v":"2028-03-07"},null,"2028-05-09",{"$f":"IF(DAY(OFFSET(INDIRECT(ADDRESS(ROW(),COLUMN())),0,-1))<8,T44+7,T44+0)","v":"2028-05-09"},null,"2028-02-28",{"$f":"IF(DAY(OFFSET(INDIRECT(ADDRESS(ROW(),COLUMN())),0,-1))>21,W44+7,IF(DAY(OFFSET(INDIRECT(ADDRESS(ROW(),COLUMN())),0,-1))<7,W44+0,IF(AND(DAY(OFFSET(INDIRECT(ADDRESS(ROW(),COLUMN())),0,-1))>7,DAY(OFFSET(INDIRECT(ADDRESS(ROW(),COLUMN())),0,-1))<15),W44+7,W44+0)))","v":"2028-03-06"},null,"2028-05-11",{"$f":"IF(DAY(OFFSET(INDIRECT(ADDRESS(ROW(),COLUMN())),0,-1))=15,Z44-7,Z44+0)","v":"2028-05-11"},null,null,null,null,null,null,null,null,null,null,null,null,null,null,null,null,"2028-05-09",{"$f":"IF(DAY(OFFSET(INDIRECT(ADDRESS(ROW(),COLUMN())),0,-1))<8,AR44+7,AR44+0)","v":"2028-05-09"},null,"2028-02-28",{"$f":"IF(DAY(OFFSET(INDIRECT(ADDRESS(ROW(),COLUMN())),0,-1))>21,AU44+7,IF(DAY(OFFSET(INDIRECT(ADDRESS(ROW(),COLUMN())),0,-1))<7,AU44+0,IF(AND(DAY(OFFSET(INDIRECT(ADDRESS(ROW(),COLUMN())),0,-1))>7,DAY(OFFSET(INDIRECT(ADDRESS(ROW(),COLUMN())),0,-1))<15),AU44+7,AU44+0)))","v":"2028-03-06"},null,"2028-05-16",{"$f":"IF(DAY(OFFSET(INDIRECT(ADDRESS(ROW(),COLUMN())),0,-1))<16,AX44+7,AX44+0)","v":"2028-05-16"},null,"2028-03-02",{"$f":"IF(DAY(OFFSET(INDIRECT(ADDRESS(ROW(),COLUMN())),0,-1))>21,BA44+7,IF(DAY(OFFSET(INDIRECT(ADDRESS(ROW(),COLUMN())),0,-1))<7,BA44+0,IF(AND(DAY(OFFSET(INDIRECT(ADDRESS(ROW(),COLUMN())),0,-1))>7,DAY(OFFSET(INDIRECT(ADDRESS(ROW(),COLUMN())),0,-1))<15),BA44+7,BA44+0)))","v":"2028-03-02"},null,"2028-02-28",{"$f":"IF(DAY(OFFSET(INDIRECT(ADDRESS(ROW(),COLUMN())),0,-1))>21,BD44+7,IF(DAY(OFFSET(INDIRECT(ADDRESS(ROW(),COLUMN())),0,-1))<7,BD44+0,IF(AND(DAY(OFFSET(INDIRECT(ADDRESS(ROW(),COLUMN())),0,-1))>7,DAY(OFFSET(INDIRECT(ADDRESS(ROW(),COLUMN())),0,-1))<15),BD44+7,BD44+0)))","v":"2028-03-06"},null,"2028-02-29",null,null,"2028-10-19",{"$f":"IF(DAY(OFFSET(INDIRECT(ADDRESS(ROW(),COLUMN())),0,-1))<15,BJ44+7,IF(DAY(OFFSET(INDIRECT(ADDRESS(ROW(),COLUMN())),0,-1))>21,BJ44-7,BJ44+0))","v":"2028-10-19"},null,"2028-05-16",{"$f":"IF(DAY(OFFSET(INDIRECT(ADDRESS(ROW(),COLUMN())),0,-1))<15,BM44+7,IF(DAY(OFFSET(INDIRECT(ADDRESS(ROW(),COLUMN())),0,-1))>21,BM44-7,BM44+0))","v":"2028-05-16"},null,"2028-04-25",{"$f":"IF(DAY(OFFSET(INDIRECT(ADDRESS(ROW(),COLUMN())),0,-1))<21,BP44+7,IF(DAY(OFFSET(INDIRECT(ADDRESS(ROW(),COLUMN())),0,-1))>28,BP44-7,BP44+0))","v":"2028-04-25"},"X","2028-12-27","2029-02-15",null,"2028-05-16",{"$f":"IF(DAY(OFFSET(INDIRECT(ADDRESS(ROW(),COLUMN())),0,-1))<15,BV44+7,IF(DAY(OFFSET(INDIRECT(ADDRESS(ROW(),COLUMN())),0,-1))>21,BV44-7,BV44+0))","v":"2028-05-16"},null,"2028-03-07",{"$f":"IF(DAY(OFFSET(INDIRECT(ADDRESS(ROW(),COLUMN())),0,-1))>21,BY44+7,IF(DAY(OFFSET(INDIRECT(ADDRESS(ROW(),COLUMN())),0,-1))<7,BY44+0,IF(AND(DAY(OFFSET(INDIRECT(ADDRESS(ROW(),COLUMN())),0,-1))>7,DAY(OFFSET(INDIRECT(ADDRESS(ROW(),COLUMN())),0,-1))<15),BY44+7,BY44+0)))","v":"2028-03-07"},null,"2027-03-02",null,null,null,null,null,"2028-05-04",{"$f":"IF(DAY(OFFSET(INDIRECT(ADDRESS(ROW(),COLUMN())),0,-1))<7,CH44+0,IF(DAY(OFFSET(INDIRECT(ADDRESS(ROW(),COLUMN())),0,-1))>7,CH44-7,CH44+0))","v":"2028-05-04"},null,"2027-05-06",null,null,"2028-05-09",{"$f":"IF(DAY(OFFSET(INDIRECT(ADDRESS(ROW(),COLUMN())),0,-1))<8,CN44+7,CN44+0)","v":"2028-05-09"},null,"2028-05-08",{"$f":"IF(DAY(OFFSET(INDIRECT(ADDRESS(ROW(),COLUMN())),0,-1))<7,CQ44+0,IF(DAY(OFFSET(INDIRECT(ADDRESS(ROW(),COLUMN())),0,-1))>7,CQ44-7,CQ44+0))","v":"2028-05-01"},null,"2028-05-08",{"$f":"IF(DAY(OFFSET(INDIRECT(ADDRESS(ROW(),COLUMN())),0,-1))<7,CT44+0,IF(DAY(OFFSET(INDIRECT(ADDRESS(ROW(),COLUMN())),0,-1))>7,CT44-7,CT44+0))+3","v":"2028-05-04"},null,"2028-05-08",{"$f":"IF(DAY(OFFSET(INDIRECT(ADDRESS(ROW(),COLUMN())),0,-1))<8,CW44+7,CW44+0)","v":"2028-05-08"},null,"2028-05-22",{"$f":"IF(DAY(OFFSET(INDIRECT(ADDRESS(ROW(),COLUMN())),0,-1))<15,CZ44+7,IF(DAY(OFFSET(INDIRECT(ADDRESS(ROW(),COLUMN())),0,-1))>21,CZ44-7,CZ44+0))","v":"2028-05-15"},"X","2029-08-07","2029-09-26"]
["2029-10-15","2030-01-15",null,null,"Chief Signature:",7,"City of Albemarle",{"$f":"M40","v":"2028-08-21"},"City of Albemarle",21,7,7,null,"2028-03-13",{"$f":"IF(DAY(OFFSET(INDIRECT(ADDRESS(ROW(),COLUMN())),0,-1))>21,N45+7,IF(DAY(OFFSET(INDIRECT(ADDRESS(ROW(),COLUMN())),0,-1))<7,N45+0,IF(AND(DAY(OFFSET(INDIRECT(ADDRESS(ROW(),COLUMN())),0,-1))>7,DAY(OFFSET(INDIRECT(ADDRESS(ROW(),COLUMN())),0,-1))<15),N45+7,N45+0)))","v":"2028-03-20"},null,"2028-03-21",{"$f":"IF(DAY(OFFSET(INDIRECT(ADDRESS(ROW(),COLUMN())),0,-1))>21,Q45+7,IF(DAY(OFFSET(INDIRECT(ADDRESS(ROW(),COLUMN())),0,-1))<7,Q45+0,IF(AND(DAY(OFFSET(INDIRECT(ADDRESS(ROW(),COLUMN())),0,-1))>7,DAY(OFFSET(INDIRECT(ADDRESS(ROW(),COLUMN())),0,-1))<15),Q45+7,Q45+0)))","v":"2028-03-21"},null,"2028-06-06",{"$f":"IF(DAY(OFFSET(INDIRECT(ADDRESS(ROW(),COLUMN())),0,-1))>21,T45+7,IF(DAY(OFFSET(INDIRECT(ADDRESS(ROW(),COLUMN())),0,-1))<7,T45+0,IF(AND(DAY(OFFSET(INDIRECT(ADDRESS(ROW(),COLUMN())),0,-1))>7,DAY(OFFSET(INDIRECT(ADDRESS(ROW(),COLUMN())),0,-1))<15),T45+7,T45+0)))","v":"2028-06-06"},null,"2028-03-13",{"$f":"IF(DAY(OFFSET(INDIRECT(ADDRESS(ROW(),COLUMN())),0,-1))>21,W45+7,IF(DAY(OFFSET(INDIRECT(ADDRESS(ROW(),COLUMN())),0,-1))<7,W45+0,IF(AND(DAY(OFFSET(INDIRECT(ADDRESS(ROW(),COLUMN())),0,-1))>7,DAY(OFFSET(INDIRECT(ADDRESS(ROW(),COLUMN())),0,-1))<15),W45+7,W45+0)))","v":"2028-03-20"},null,"2028-06-15",{"$f":"IF(DAY(OFFSET(INDIRECT(ADDRESS(ROW(),COLUMN())),0,-1))<8,Z45+7,Z45+0)","v":"2028-06-15"},null,null,null,null,null,null,null,null,null,null,null,null,null,null,null,null,"2028-06-06",{"$f":"IF(DAY(OFFSET(INDIRECT(ADDRESS(ROW(),COLUMN())),0,-1))<8,AR45+7,AR45+0)","v":"2028-06-13"},null,"2028-03-13",{"$f":"IF(DAY(OFFSET(INDIRECT(ADDRESS(ROW(),COLUMN())),0,-1))>21,AU45+7,IF(DAY(OFFSET(INDIRECT(ADDRESS(ROW(),COLUMN())),0,-1))<7,AU45+0,IF(AND(DAY(OFFSET(INDIRECT(ADDRESS(ROW(),COLUMN())),0,-1))>7,DAY(OFFSET(INDIRECT(ADDRESS(ROW(),COLUMN())),0,-1))<15),AU45+7,AU45+0)))","v":"2028-03-20"},null,"2028-06-20",{"$f":"IF(DAY(OFFSET(INDIRECT(ADDRESS(ROW(),COLUMN())),0,-1))<16,AX45+7,AX45+0)","v":"2028-06-20"},null,"2028-03-16",{"$f":"IF(DAY(OFFSET(INDIRECT(ADDRESS(ROW(),COLUMN())),0,-1))>21,BA45+7,IF(DAY(OFFSET(INDIRECT(ADDRESS(ROW(),COLUMN())),0,-1))<7,BA45+0,IF(AND(DAY(OFFSET(INDIRECT(ADDRESS(ROW(),COLUMN())),0,-1))>7,DAY(OFFSET(INDIRECT(ADDRESS(ROW(),COLUMN())),0,-1))<15),BA45+7,BA45+0)))","v":"2028-03-16"},null,"2028-03-21",{"$f":"IF(DAY(OFFSET(INDIRECT(ADDRESS(ROW(),COLUMN())),0,-1))>21,BD45+7,IF(DAY(OFFSET(INDIRECT(ADDRESS(ROW(),COLUMN())),0,-1))<7,BD45+0,IF(AND(DAY(OFFSET(INDIRECT(ADDRESS(ROW(),COLUMN())),0,-1))>7,DAY(OFFSET(INDIRECT(ADDRESS(ROW(),COLUMN())),0,-1))<15),BD45+7,BD45+0)))","v":"2028-03-21"},null,"2028-03-14",null,null,"2028-11-16",{"$f":"IF(DAY(OFFSET(INDIRECT(ADDRESS(ROW(),COLUMN())),0,-1))<15,BJ45+7,IF(DAY(OFFSET(INDIRECT(ADDRESS(ROW(),COLUMN())),0,-1))>21,BJ45-7,BJ45+0))","v":"2028-11-16"},null,"2028-06-20",{"$f":"IF(DAY(OFFSET(INDIRECT(ADDRESS(ROW(),COLUMN())),0,-1))<15,BM45+7,IF(DAY(OFFSET(INDIRECT(ADDRESS(ROW(),COLUMN())),0,-1))>21,BM45-7,BM45+0))","v":"2028-06-20"},null,"2028-05-23",{"$f":"IF(DAY(OFFSET(INDIRECT(ADDRESS(ROW(),COLUMN())),0,-1))<21,BP45+7,IF(DAY(OFFSET(INDIRECT(ADDRESS(ROW(),COLUMN())),0,-1))>28,BP45-7,BP45+0))","v":"2028-05-23"},"X","2029-01-14","2029-03-05",null,"2028-06-20",{"$f":"IF(DAY(OFFSET(INDIRECT(ADDRESS(ROW(),COLUMN())),0,-1))<15,BV45+7,IF(DAY(OFFSET(INDIRECT(ADDRESS(ROW(),COLUMN())),0,-1))>21,BV45-7,BV45+0))","v":"2028-06-20"},null,"2028-03-21",{"$f":"IF(DAY(OFFSET(INDIRECT(ADDRESS(ROW(),COLUMN())),0,-1))>21,BY45+7,IF(DAY(OFFSET(INDIRECT(ADDRESS(ROW(),COLUMN())),0,-1))<7,BY45+0,IF(AND(DAY(OFFSET(INDIRECT(ADDRESS(ROW(),COLUMN())),0,-1))>7,DAY(OFFSET(INDIRECT(ADDRESS(ROW(),COLUMN())),0,-1))<15),BY45+7,BY45+0)))","v":"2028-03-21"},null,"2027-03-16",null,null,null,null,null,"2028-06-08",{"$f":"IF(DAY(OFFSET(INDIRECT(ADDRESS(ROW(),COLUMN())),0,-1))<7,CH45+0,IF(DAY(OFFSET(INDIRECT(ADDRESS(ROW(),COLUMN())),0,-1))>7,CH45-7,CH45+0))","v":"2028-06-01"},null,"2027-06-03",null,null,"2028-06-06",{"$f":"IF(DAY(OFFSET(INDIRECT(ADDRESS(ROW(),COLUMN())),0,-1))>21,CN45+7,IF(DAY(OFFSET(INDIRECT(ADDRESS(ROW(),COLUMN())),0,-1))<7,CN45+0,IF(AND(DAY(OFFSET(INDIRECT(ADDRESS(ROW(),COLUMN())),0,-1))>7,DAY(OFFSET(INDIRECT(ADDRESS(ROW(),COLUMN())),0,-1))<15),CN45+7,CN45+0)))","v":"2028-06-06"},null,"2028-06-05",{"$f":"IF(DAY(OFFSET(INDIRECT(ADDRESS(ROW(),COLUMN())),0,-1))<7,CQ45+0,IF(DAY(OFFSET(INDIRECT(ADDRESS(ROW(),COLUMN())),0,-1))>7,CQ45-7,CQ45+0))","v":"2028-06-05"},null,"2028-06-05",{"$f":"IF(DAY(OFFSET(INDIRECT(ADDRESS(ROW(),COLUMN())),0,-1))<7,CT45+0,IF(DAY(OFFSET(INDIRECT(ADDRESS(ROW(),COLUMN())),0,-1))>7,CT45-7,CT45+0))+3","v":"2028-06-08"},null,"2028-06-05",{"$f":"IF(DAY(OFFSET(INDIRECT(ADDRESS(ROW(),COLUMN())),0,-1))<8,CW45+7,CW45+0)","v":"2028-06-12"},null,"2028-06-19",{"$f":"IF(DAY(OFFSET(INDIRECT(ADDRESS(ROW(),COLUMN())),0,-1))<15,CZ45+7,IF(DAY(OFFSET(INDIRECT(ADDRESS(ROW(),COLUMN())),0,-1))>21,CZ45-7,CZ45+0))","v":"2028-06-19"},"X","2029-08-13","2029-10-02"]
[null,null,null,null,null,null,"City of Concord",{"$f":"Y35","v":"2028-08-10"},"City of Concord",0,14,14,null,"2028-04-03",{"$f":"IF(DAY(OFFSET(INDIRECT(ADDRESS(ROW(),COLUMN())),0,-1))>21,N46+7,IF(DAY(OFFSET(INDIRECT(ADDRESS(ROW(),COLUMN())),0,-1))<7,N46+0,IF(AND(DAY(OFFSET(INDIRECT(ADDRESS(ROW(),COLUMN())),0,-1))>7,DAY(OFFSET(INDIRECT(ADDRESS(ROW(),COLUMN())),0,-1))<15),N46+7,N46+0)))","v":"2028-04-03"},null,"2028-04-04",{"$f":"IF(DAY(OFFSET(INDIRECT(ADDRESS(ROW(),COLUMN())),0,-1))>21,Q46+7,IF(DAY(OFFSET(INDIRECT(ADDRESS(ROW(),COLUMN())),0,-1))<7,Q46+0,IF(AND(DAY(OFFSET(INDIRECT(ADDRESS(ROW(),COLUMN())),0,-1))>7,DAY(OFFSET(INDIRECT(ADDRESS(ROW(),COLUMN())),0,-1))<15),Q46+7,Q46+0)))","v":"2028-04-04"},null,"2028-07-11",{"$f":"IF(DAY(OFFSET(INDIRECT(ADDRESS(ROW(),COLUMN())),0,-1))>21,T46+7,IF(DAY(OFFSET(INDIRECT(ADDRESS(ROW(),COLUMN())),0,-1))<7,T46+0,IF(AND(DAY(OFFSET(INDIRECT(ADDRESS(ROW(),COLUMN())),0,-1))>7,DAY(OFFSET(INDIRECT(ADDRESS(ROW(),COLUMN())),0,-1))<15),T46+7,T46+0)))","v":"2028-07-18"},null,"2028-04-03",{"$f":"IF(DAY(OFFSET(INDIRECT(ADDRESS(ROW(),COLUMN())),0,-1))>21,W46+7,IF(DAY(OFFSET(INDIRECT(ADDRESS(ROW(),COLUMN())),0,-1))<7,W46+0,IF(AND(DAY(OFFSET(INDIRECT(ADDRESS(ROW(),COLUMN())),0,-1))>7,DAY(OFFSET(INDIRECT(ADDRESS(ROW(),COLUMN())),0,-1))<15),W46+7,W46+0)))","v":"2028-04-03"},null,"2028-07-13",{"$f":"IF(DAY(OFFSET(INDIRECT(ADDRESS(ROW(),COLUMN())),0,-1))<8,Z46+7,Z46+0)","v":"2028-07-13"},null,null,null,null,null,null,null,null,null,null,null,null,null,null,null,null,"2028-07-11",{"$f":"IF(DAY(OFFSET(INDIRECT(ADDRESS(ROW(),COLUMN())),0,-1))<8,AR46+7,AR46+0)","v":"2028-07-11"},null,"2028-04-03",{"$f":"IF(DAY(OFFSET(INDIRECT(ADDRESS(ROW(),COLUMN())),0,-1))>21,AU46+7,IF(DAY(OFFSET(INDIRECT(ADDRESS(ROW(),COLUMN())),0,-1))<7,AU46+0,IF(AND(DAY(OFFSET(INDIRECT(ADDRESS(ROW(),COLUMN())),0,-1))>7,DAY(OFFSET(INDIRECT(ADDRESS(ROW(),COLUMN())),0,-1))<15),AU46+7,AU46+0)))","v":"2028-04-03"},null,"2028-07-18",{"$f":"IF(DAY(OFFSET(INDIRECT(ADDRESS(ROW(),COLUMN())),0,-1))<16,AX46+7,AX46+0)","v":"2028-07-18"},null,"2028-03-30",{"$f":"IF(DAY(OFFSET(INDIRECT(ADDRESS(ROW(),COLUMN())),0,-1))>21,BA46+7,IF(DAY(OFFSET(INDIRECT(ADDRESS(ROW(),COLUMN())),0,-1))<7,BA46+0,IF(AND(DAY(OFFSET(INDIRECT(ADDRESS(ROW(),COLUMN())),0,-1))>7,DAY(OFFSET(INDIRECT(ADDRESS(ROW(),COLUMN())),0,-1))<15),BA46+7,BA46+0)))","v":"2028-04-06"},null,"2028-04-03",{"$f":"IF(DAY(OFFSET(INDIRECT(ADDRESS(ROW(),COLUMN())),0,-1))>21,BD46+7,IF(DAY(OFFSET(INDIRECT(ADDRESS(ROW(),COLUMN())),0,-1))<7,BD46+0,IF(AND(DAY(OFFSET(INDIRECT(ADDRESS(ROW(),COLUMN())),0,-1))>7,DAY(OFFSET(INDIRECT(ADDRESS(ROW(),COLUMN())),0,-1))<15),BD46+7,BD46+0)))","v":"2028-04-03"},null,"2028-04-04",null,null,"2028-12-21",{"$f":"IF(DAY(OFFSET(INDIRECT(ADDRESS(ROW(),COLUMN())),0,-1))<15,BJ46+7,IF(DAY(OFFSET(INDIRECT(ADDRESS(ROW(),COLUMN())),0,-1))>21,BJ46-7,BJ46+0))","v":"2028-12-21"},null,"2028-07-18",{"$f":"IF(DAY(OFFSET(INDIRECT(ADDRESS(ROW(),COLUMN())),0,-1))<15,BM46+7,IF(DAY(OFFSET(INDIRECT(ADDRESS(ROW(),COLUMN())),0,-1))>21,BM46-7,BM46+0))","v":"2028-07-18"},null,"2028-06-27",{"$f":"IF(DAY(OFFSET(INDIRECT(ADDRESS(ROW(),COLUMN())),0,-1))<21,BP46+7,IF(DAY(OFFSET(INDIRECT(ADDRESS(ROW(),COLUMN())),0,-1))>28,BP46-7,BP46+0))","v":"2028-06-27"},{"$f":"IF(AND($B$8>=BS45,$B$8<=BS46),BS46,\"X\")","v":"X"},"2029-01-30","2029-03-21",null,"2028-07-18",{"$f":"IF(DAY(OFFSET(INDIRECT(ADDRESS(ROW(),COLUMN())),0,-1))<15,BV46+7,IF(DAY(OFFSET(INDIRECT(ADDRESS(ROW(),COLUMN())),0,-1))>21,BV46-7,BV46+0))","v":"2028-07-18"},null,"2028-04-04",{"$f":"IF(DAY(OFFSET(INDIRECT(ADDRESS(ROW(),COLUMN())),0,-1))>21,BY46+7,IF(DAY(OFFSET(INDIRECT(ADDRESS(ROW(),COLUMN())),0,-1))<7,BY46+0,IF(AND(DAY(OFFSET(INDIRECT(ADDRESS(ROW(),COLUMN())),0,-1))>7,DAY(OFFSET(INDIRECT(ADDRESS(ROW(),COLUMN())),0,-1))<15),BY46+7,BY46+0)))","v":"2028-04-04"},null,null,null,null,null,null,null,"2028-07-06",{"$f":"IF(DAY(OFFSET(INDIRECT(ADDRESS(ROW(),COLUMN())),0,-1))<7,CH46+0,IF(DAY(OFFSET(INDIRECT(ADDRESS(ROW(),COLUMN())),0,-1))>7,CH46-7,CH46+0))","v":"2028-07-06"},null,null,null,null,"2028-07-11",{"$f":"IF(DAY(OFFSET(INDIRECT(ADDRESS(ROW(),COLUMN())),0,-1))>21,CN46+7,IF(DAY(OFFSET(INDIRECT(ADDRESS(ROW(),COLUMN())),0,-1))<7,CN46+0,IF(AND(DAY(OFFSET(INDIRECT(ADDRESS(ROW(),COLUMN())),0,-1))>7,DAY(OFFSET(INDIRECT(ADDRESS(ROW(),COLUMN())),0,-1))<15),CN46+7,CN46+0)))","v":"2028-07-18"},null,"2028-07-03",{"$f":"IF(DAY(OFFSET(INDIRECT(ADDRESS(ROW(),COLUMN())),0,-1))<7,CQ46+0,IF(DAY(OFFSET(INDIRECT(ADDRESS(ROW(),COLUMN())),0,-1))>7,CQ46-7,CQ46+0))","v":"2028-07-03"},null,"2028-07-03",{"$f":"IF(DAY(OFFSET(INDIRECT(ADDRESS(ROW(),COLUMN())),0,-1))<7,CT46+0,IF(DAY(OFFSET(INDIRECT(ADDRESS(ROW(),COLUMN())),0,-1))>7,CT46-7,CT46+0))+3","v":"2028-07-06"},null,"2028-07-03",{"$f":"IF(DAY(OFFSET(INDIRECT(ADDRESS(ROW(),COLUMN())),0,-1))<8,CW46+7,CW46+0)","v":"2028-07-10"},null,"2028-07-17",{"$f":"IF(DAY(OFFSET(INDIRECT(ADDRESS(ROW(),COLUMN())),0,-1))<15,CZ46+7,IF(DAY(OFFSET(INDIRECT(ADDRESS(ROW(),COLUMN())),0,-1))>21,CZ46-7,CZ46+0))","v":"2028-07-17"},"X","2029-09-04","2029-10-24"]
[null,null,null,null,null,null,"City of Kannapolis",{"$f":"I34","v":"2028-08-14"},"City of Kannapolis",7,14,7,null,"2028-04-17",{"$f":"IF(DAY(OFFSET(INDIRECT(ADDRESS(ROW(),COLUMN())),0,-1))>21,N47+7,IF(DAY(OFFSET(INDIRECT(ADDRESS(ROW(),COLUMN())),0,-1))<7,N47+0,IF(AND(DAY(OFFSET(INDIRECT(ADDRESS(ROW(),COLUMN())),0,-1))>7,DAY(OFFSET(INDIRECT(ADDRESS(ROW(),COLUMN())),0,-1))<15),N47+7,N47+0)))","v":"2028-04-17"},null,"2028-04-18",{"$f":"IF(DAY(OFFSET(INDIRECT(ADDRESS(ROW(),COLUMN())),0,-1))>21,Q47+7,IF(DAY(OFFSET(INDIRECT(ADDRESS(ROW(),COLUMN())),0,-1))<7,Q47+0,IF(AND(DAY(OFFSET(INDIRECT(ADDRESS(ROW(),COLUMN())),0,-1))>7,DAY(OFFSET(INDIRECT(ADDRESS(ROW(),COLUMN())),0,-1))<15),Q47+7,Q47+0)))","v":"2028-04-18"},null,"2028-08-08",{"$f":"IF(DAY(OFFSET(INDIRECT(ADDRESS(ROW(),COLUMN())),0,-1))>21,T47+7,IF(DAY(OFFSET(INDIRECT(ADDRESS(ROW(),COLUMN())),0,-1))<7,T47+0,IF(AND(DAY(OFFSET(INDIRECT(ADDRESS(ROW(),COLUMN())),0,-1))>7,DAY(OFFSET(INDIRECT(ADDRESS(ROW(),COLUMN())),0,-1))<15),T47+7,T47+0)))","v":"2028-08-15"},null,"2028-04-17",{"$f":"IF(DAY(OFFSET(INDIRECT(ADDRESS(ROW(),COLUMN())),0,-1))>21,W47+7,IF(DAY(OFFSET(INDIRECT(ADDRESS(ROW(),COLUMN())),0,-1))<7,W47+0,IF(AND(DAY(OFFSET(INDIRECT(ADDRESS(ROW(),COLUMN())),0,-1))>7,DAY(OFFSET(INDIRECT(ADDRESS(ROW(),COLUMN())),0,-1))<15),W47+7,W47+0)))","v":"2028-04-17"},null,"2028-08-10",{"$f":"IF(DAY(OFFSET(INDIRECT(ADDRESS(ROW(),COLUMN())),0,-1))<8,Z47+7,Z47+0)","v":"2028-08-10"},null,null,null,null,null,null,null,null,null,null,null,null,null,null,null,null,"2028-08-08",{"$f":"IF(DAY(OFFSET(INDIRECT(ADDRESS(ROW(),COLUMN())),0,-1))<8,AR47+7,AR47+0)","v":"2028-08-08"},null,"2028-04-17",{"$f":"IF(DAY(OFFSET(INDIRECT(ADDRESS(ROW(),COLUMN())),0,-1))>21,AU47+7,IF(DAY(OFFSET(INDIRECT(ADDRESS(ROW(),COLUMN())),0,-1))<7,AU47+0,IF(AND(DAY(OFFSET(INDIRECT(ADDRESS(ROW(),COLUMN())),0,-1))>7,DAY(OFFSET(INDIRECT(ADDRESS(ROW(),COLUMN())),0,-1))<15),AU47+7,AU47+0)))","v":"2028-04-17"},null,"2028-08-15",{"$f":"IF(DAY(OFFSET(INDIRECT(ADDRESS(ROW(),COLUMN())),0,-1))<16,AX47+7,AX47+0)","v":"2028-08-22"},null,"2028-04-13",{"$f":"IF(DAY(OFFSET(INDIRECT(ADDRESS(ROW(),COLUMN())),0,-1))>21,BA47+7,IF(DAY(OFFSET(INDIRECT(ADDRESS(ROW(),COLUMN())),0,-1))<7,BA47+0,IF(AND(DAY(OFFSET(INDIRECT(ADDRESS(ROW(),COLUMN())),0,-1))>7,DAY(OFFSET(INDIRECT(ADDRESS(ROW(),COLUMN())),0,-1))<15),BA47+7,BA47+0)))","v":"2028-04-20"},null,"2028-04-18",{"$f":"IF(DAY(OFFSET(INDIRECT(ADDRESS(ROW(),COLUMN())),0,-1))>21,BD47+7,IF(DAY(OFFSET(INDIRECT(ADDRESS(ROW(),COLUMN())),0,-1))<7,BD47+0,IF(AND(DAY(OFFSET(INDIRECT(ADDRESS(ROW(),COLUMN())),0,-1))>7,DAY(OFFSET(INDIRECT(ADDRESS(ROW(),COLUMN())),0,-1))<15),BD47+7,BD47+0)))","v":"2028-04-18"},null,"2028-04-18",null,null,"2029-01-18",{"$f":"IF(DAY(OFFSET(INDIRECT(ADDRESS(ROW(),COLUMN())),0,-1))<15,BJ47+7,IF(DAY(OFFSET(INDIRECT(ADDRESS(ROW(),COLUMN())),0,-1))>21,BJ47-7,BJ47+0))","v":"2029-01-18"},null,"2028-08-22",{"$f":"IF(DAY(OFFSET(INDIRECT(ADDRESS(ROW(),COLUMN())),0,-1))<15,BM47+7,IF(DAY(OFFSET(INDIRECT(ADDRESS(ROW(),COLUMN())),0,-1))>21,BM47-7,BM47+0))","v":"2028-08-15"},null,"2028-07-25",{"$f":"IF(DAY(OFFSET(INDIRECT(ADDRESS(ROW(),COLUMN())),0,-1))<21,BP47+7,IF(DAY(OFFSET(INDIRECT(ADDRESS(ROW(),COLUMN())),0,-1))>28,BP47-7,BP47+0))","v":"2028-07-25"},{"$f":"IF(AND($B$8>=BS46,$B$8<=BS47),BS47,\"X\")","v":"X"},"2029-01-24","2029-03-15",null,"2028-08-22",{"$f":"IF(DAY(OFFSET(INDIRECT(ADDRESS(ROW(),COLUMN())),0,-1))<15,BV47+7,IF(DAY(OFFSET(INDIRECT(ADDRESS(ROW(),COLUMN())),0,-1))>21,BV47-7,BV47+0))","v":"2028-08-15"},null,"2028-04-18",{"$f":"IF(DAY(OFFSET(INDIRECT(ADDRESS(ROW(),COLUMN())),0,-1))>21,BY47+7,IF(DAY(OFFSET(INDIRECT(ADDRESS(ROW(),COLUMN())),0,-1))<7,BY47+0,IF(AND(DAY(OFFSET(INDIRECT(ADDRESS(ROW(),COLUMN())),0,-1))>7,DAY(OFFSET(INDIRECT(ADDRESS(ROW(),COLUMN())),0,-1))<15),BY47+7,BY47+0)))","v":"2028-04-18"},null,null,null,null,null,null,null,"2028-08-03",{"$f":"IF(DAY(OFFSET(INDIRECT(ADDRESS(ROW(),COLUMN())),0,-1))<7,CH47+0,IF(DAY(OFFSET(INDIRECT(ADDRESS(ROW(),COLUMN())),0,-1))>7,CH47-7,CH47+0))","v":"2028-08-03"},null,null,null,null,"2028-08-08",{"$f":"IF(DAY(OFFSET(INDIRECT(ADDRESS(ROW(),COLUMN())),0,-1))>21,CN47+7,IF(DAY(OFFSET(INDIRECT(ADDRESS(ROW(),COLUMN())),0,-1))<7,CN47+0,IF(AND(DAY(OFFSET(INDIRECT(ADDRESS(ROW(),COLUMN())),0,-1))>7,DAY(OFFSET(INDIRECT(ADDRESS(ROW(),COLUMN())),0,-1))<15),CN47+7,CN47+0)))","v":"2028-08-15"},null,"2028-08-07",{"$f":"IF(DAY(OFFSET(INDIRECT(ADDRESS(ROW(),COLUMN())),0,-1))<7,CQ47+0,IF(DAY(OFFSET(INDIRECT(ADDRESS(ROW(),COLUMN())),0,-1))>7,CQ47-7,CQ47+0))","v":"2028-08-07"},null,"2028-08-07",{"$f":"IF(DAY(OFFSET(INDIRECT(ADDRESS(ROW(),COLUMN())),0,-1))<7,CT47+0,IF(DAY(OFFSET(INDIRECT(ADDRESS(ROW(),COLUMN())),0,-1))>7,CT47-7,CT47+0))+3","v":"2028-08-10"},null,"2028-08-07",{"$f":"IF(DAY(OFFSET(INDIRECT(ADDRESS(ROW(),COLUMN())),0,-1))<8,CW47+7,CW47+0)","v":"2028-08-14"},null,"2028-08-21",{"$f":"IF(DAY(OFFSET(INDIRECT(ADDRESS(ROW(),COLUMN())),0,-1))<15,CZ47+7,IF(DAY(OFFSET(INDIRECT(ADDRESS(ROW(),COLUMN())),0,-1))>21,CZ47-7,CZ47+0))","v":"2028-08-21"},"X","2029-09-17","2029-11-06"]
[null,null,null,null,null,null,"City of Monroe",{"$f":"AE31","v":"2028-09-05"},"City of Monroe",0,14,14,null,"2028-05-01",{"$f":"IF(DAY(OFFSET(INDIRECT(ADDRESS(ROW(),COLUMN())),0,-1))>21,N48+7,IF(DAY(OFFSET(INDIRECT(ADDRESS(ROW(),COLUMN())),0,-1))<7,N48+0,IF(AND(DAY(OFFSET(INDIRECT(ADDRESS(ROW(),COLUMN())),0,-1))>7,DAY(OFFSET(INDIRECT(ADDRESS(ROW(),COLUMN())),0,-1))<15),N48+7,N48+0)))","v":"2028-05-01"},null,"2028-05-02",{"$f":"IF(DAY(OFFSET(INDIRECT(ADDRESS(ROW(),COLUMN())),0,-1))>21,Q48+7,IF(DAY(OFFSET(INDIRECT(ADDRESS(ROW(),COLUMN())),0,-1))<7,Q48+0,IF(AND(DAY(OFFSET(INDIRECT(ADDRESS(ROW(),COLUMN())),0,-1))>7,DAY(OFFSET(INDIRECT(ADDRESS(ROW(),COLUMN())),0,-1))<15),Q48+7,Q48+0)))","v":"2028-05-02"},null,"2028-09-12",{"$f":"IF(DAY(OFFSET(INDIRECT(ADDRESS(ROW(),COLUMN())),0,-1))>21,T48+7,IF(DAY(OFFSET(INDIRECT(ADDRESS(ROW(),COLUMN())),0,-1))<7,T48+0,IF(AND(DAY(OFFSET(INDIRECT(ADDRESS(ROW(),COLUMN())),0,-1))>7,DAY(OFFSET(INDIRECT(ADDRESS(ROW(),COLUMN())),0,-1))<15),T48+7,T48+0)))","v":"2028-09-19"},null,"2028-05-01",{"$f":"IF(DAY(OFFSET(INDIRECT(ADDRESS(ROW(),COLUMN())),0,-1))>21,W48+7,IF(DAY(OFFSET(INDIRECT(ADDRESS(ROW(),COLUMN())),0,-1))<7,W48+0,IF(AND(DAY(OFFSET(INDIRECT(ADDRESS(ROW(),COLUMN())),0,-1))>7,DAY(OFFSET(INDIRECT(ADDRESS(ROW(),COLUMN())),0,-1))<15),W48+7,W48+0)))","v":"2028-05-01"},null,"2028-09-14",{"$f":"IF(DAY(OFFSET(INDIRECT(ADDRESS(ROW(),COLUMN())),0,-1))<8,Z48+7,Z48+0)","v":"2028-09-14"},null,null,null,null,null,null,null,null,null,null,null,null,null,null,null,null,"2028-09-12",{"$f":"IF(DAY(OFFSET(INDIRECT(ADDRESS(ROW(),COLUMN())),0,-1))<8,AR48+7,AR48+0)","v":"2028-09-12"},null,"2028-05-01",{"$f":"IF(DAY(OFFSET(INDIRECT(ADDRESS(ROW(),COLUMN())),0,-1))>21,AU48+7,IF(DAY(OFFSET(INDIRECT(ADDRESS(ROW(),COLUMN())),0,-1))<7,AU48+0,IF(AND(DAY(OFFSET(INDIRECT(ADDRESS(ROW(),COLUMN())),0,-1))>7,DAY(OFFSET(INDIRECT(ADDRESS(ROW(),COLUMN())),0,-1))<15),AU48+7,AU48+0)))","v":"2028-05-01"},null,"2028-09-19",{"$f":"IF(DAY(OFFSET(INDIRECT(ADDRESS(ROW(),COLUMN())),0,-1))<16,AX48+7,AX48+0)","v":"2028-09-19"},null,"2028-05-04",{"$f":"IF(DAY(OFFSET(INDIRECT(ADDRESS(ROW(),COLUMN())),0,-1))>21,BA48+7,IF(DAY(OFFSET(INDIRECT(ADDRESS(ROW(),COLUMN())),0,-1))<7,BA48+0,IF(AND(DAY(OFFSET(INDIRECT(ADDRESS(ROW(),COLUMN())),0,-1))>7,DAY(OFFSET(INDIRECT(ADDRESS(ROW(),COLUMN())),0,-1))<15),BA48+7,BA48+0)))","v":"2028-05-04"},null,"2028-05-01",{"$f":"IF(DAY(OFFSET(INDIRECT(ADDRESS(ROW(),COLUMN())),0,-1))>21,BD48+7,IF(DAY(OFFSET(INDIRECT(ADDRESS(ROW(),COLUMN())),0,-1))<7,BD48+0,IF(AND(DAY(OFFSET(INDIRECT(ADDRESS(ROW(),COLUMN())),0,-1))>7,DAY(OFFSET(INDIRECT(ADDRESS(ROW(),COLUMN())),0,-1))<15),BD48+7,BD48+0)))","v":"2028-05-01"},null,"2028-05-02",null,null,"2029-02-22",{"$f":"IF(DAY(OFFSET(INDIRECT(ADDRESS(ROW(),COLUMN())),0,-1))<15,BJ48+7,IF(DAY(OFFSET(INDIRECT(ADDRESS(ROW(),COLUMN())),0,-1))>21,BJ48-7,BJ48+0))","v":"2029-02-15"},null,"2028-09-19",{"$f":"IF(DAY(OFFSET(INDIRECT(ADDRESS(ROW(),COLUMN())),0,-1))<15,BM48+7,IF(DAY(OFFSET(INDIRECT(ADDRESS(ROW(),COLUMN())),0,-1))>21,BM48-7,BM48+0))","v":"2028-09-19"},null,"2028-08-29",{"$f":"IF(DAY(OFFSET(INDIRECT(ADDRESS(ROW(),COLUMN())),0,-1))<21,BP48+7,IF(DAY(OFFSET(INDIRECT(ADDRESS(ROW(),COLUMN())),0,-1))>28,BP48-7,BP48+0))","v":"2028-08-22"},{"$f":"IF(AND($B$8>=BS47,$B$8<=BS48),BS48,\"X\")","v":"X"},"2029-02-11","2029-04-02",null,"2028-09-19",{"$f":"IF(DAY(OFFSET(INDIRECT(ADDRESS(ROW(),COLUMN())),0,-1))<15,BV48+7,IF(DAY(OFFSET(INDIRECT(ADDRESS(ROW(),COLUMN())),0,-1))>21,BV48-7,BV48+0))","v":"2028-09-19"},null,"2028-05-02",{"$f":"IF(DAY(OFFSET(INDIRECT(ADDRESS(ROW(),COLUMN())),0,-1))>21,BY48+7,IF(DAY(OFFSET(INDIRECT(ADDRESS(ROW(),COLUMN())),0,-1))<7,BY48+0,IF(AND(DAY(OFFSET(INDIRECT(ADDRESS(ROW(),COLUMN())),0,-1))>7,DAY(OFFSET(INDIRECT(ADDRESS(ROW(),COLUMN())),0,-1))<15),BY48+7,BY48+0)))","v":"2028-05-02"},null,null,null,null,null,null,null,"2028-09-07",{"$f":"IF(DAY(OFFSET(INDIRECT(ADDRESS(ROW(),COLUMN())),0,-1))<7,CH48+0,IF(DAY(OFFSET(INDIRECT(ADDRESS(ROW(),COLUMN())),0,-1))>7,CH48-7,CH48+0))","v":"2028-09-07"},null,null,null,null,"2028-09-12",{"$f":"IF(DAY(OFFSET(INDIRECT(ADDRESS(ROW(),COLUMN())),0,-1))>21,CN48+7,IF(DAY(OFFSET(INDIRECT(ADDRESS(ROW(),COLUMN())),0,-1))<7,CN48+0,IF(AND(DAY(OFFSET(INDIRECT(ADDRESS(ROW(),COLUMN())),0,-1))>7,DAY(OFFSET(INDIRECT(ADDRESS(ROW(),COLUMN())),0,-1))<15),CN48+7,CN48+0)))","v":"2028-09-19"},null,"2028-09-04",{"$f":"IF(DAY(OFFSET(INDIRECT(ADDRESS(ROW(),COLUMN())),0,-1))<7,CQ48+0,IF(DAY(OFFSET(INDIRECT(ADDRESS(ROW(),COLUMN())),0,-1))>7,CQ48-7,CQ48+0))","v":"2028-09-04"},null,"2028-09-04",{"$f":"IF(DAY(OFFSET(INDIRECT(ADDRESS(ROW(),COLUMN())),0,-1))<7,CT48+0,IF(DAY(OFFSET(INDIRECT(ADDRESS(ROW(),COLUMN())),0,-1))>7,CT48-7,CT48+0))+3","v":"2028-09-07"},null,"2028-09-04",{"$f":"IF(DAY(OFFSET(INDIRECT(ADDRESS(ROW(),COLUMN())),0,-1))<8,CW48+7,CW48+0)","v":"2028-09-11"},null,"2028-09-18",{"$f":"IF(DAY(OFFSET(INDIRECT(ADDRESS(ROW(),COLUMN())),0,-1))<15,CZ48+7,IF(DAY(OFFSET(INDIRECT(ADDRESS(ROW(),COLUMN())),0,-1))>21,CZ48-7,CZ48+0))","v":"2028-09-18"},"X","2029-10-09","2029-11-28"]
[null,null,null,null,null,null,"Town of Matthews",{"$f":"I34","v":"2028-08-14"},"Town of Matthews",null,null,null,null,"2028-05-15",{"$f":"IF(DAY(OFFSET(INDIRECT(ADDRESS(ROW(),COLUMN())),0,-1))>21,N49+7,IF(DAY(OFFSET(INDIRECT(ADDRESS(ROW(),COLUMN())),0,-1))<7,N49+0,IF(AND(DAY(OFFSET(INDIRECT(ADDRESS(ROW(),COLUMN())),0,-1))>7,DAY(OFFSET(INDIRECT(ADDRESS(ROW(),COLUMN())),0,-1))<15),N49+7,N49+0)))","v":"2028-05-15"},null,"2028-05-16",{"$f":"IF(DAY(OFFSET(INDIRECT(ADDRESS(ROW(),COLUMN())),0,-1))>21,Q49+7,IF(DAY(OFFSET(INDIRECT(ADDRESS(ROW(),COLUMN())),0,-1))<7,Q49+0,IF(AND(DAY(OFFSET(INDIRECT(ADDRESS(ROW(),COLUMN())),0,-1))>7,DAY(OFFSET(INDIRECT(ADDRESS(ROW(),COLUMN())),0,-1))<15),Q49+7,Q49+0)))","v":"2028-05-16"},null,"2028-10-10",{"$f":"IF(DAY(OFFSET(INDIRECT(ADDRESS(ROW(),COLUMN())),0,-1))>21,T49+7,IF(DAY(OFFSET(INDIRECT(ADDRESS(ROW(),COLUMN())),0,-1))<7,T49+0,IF(AND(DAY(OFFSET(INDIRECT(ADDRESS(ROW(),COLUMN())),0,-1))>7,DAY(OFFSET(INDIRECT(ADDRESS(ROW(),COLUMN())),0,-1))<15),T49+7,T49+0)))","v":"2028-10-17"},null,"2028-05-15",{"$f":"IF(DAY(OFFSET(INDIRECT(ADDRESS(ROW(),COLUMN())),0,-1))>21,W49+7,IF(DAY(OFFSET(INDIRECT(ADDRESS(ROW(),COLUMN())),0,-1))<7,W49+0,IF(AND(DAY(OFFSET(INDIRECT(ADDRESS(ROW(),COLUMN())),0,-1))>7,DAY(OFFSET(INDIRECT(ADDRESS(ROW(),COLUMN())),0,-1))<15),W49+7,W49+0)))","v":"2028-05-15"},null,"2028-10-12",{"$f":"IF(DAY(OFFSET(INDIRECT(ADDRESS(ROW(),COLUMN())),0,-1))<8,Z49+7,Z49+0)","v":"2028-10-12"},null,null,null,null,null,null,null,null,null,null,null,null,null,null,null,null,"2028-10-10",{"$f":"IF(DAY(OFFSET(INDIRECT(ADDRESS(ROW(),COLUMN())),0,-1))<8,AR49+7,AR49+0)","v":"2028-10-10"},null,"2028-05-15",{"$f":"IF(DAY(OFFSET(INDIRECT(ADDRESS(ROW(),COLUMN())),0,-1))>21,AU49+7,IF(DAY(OFFSET(INDIRECT(ADDRESS(ROW(),COLUMN())),0,-1))<7,AU49+0,IF(AND(DAY(OFFSET(INDIRECT(ADDRESS(ROW(),COLUMN())),0,-1))>7,DAY(OFFSET(INDIRECT(ADDRESS(ROW(),COLUMN())),0,-1))<15),AU49+7,AU49+0)))","v":"2028-05-15"},null,"2028-10-17",{"$f":"IF(DAY(OFFSET(INDIRECT(ADDRESS(ROW(),COLUMN())),0,-1))<16,AX49+7,AX49+0)","v":"2028-10-17"},null,"2028-05-18",{"$f":"IF(DAY(OFFSET(INDIRECT(ADDRESS(ROW(),COLUMN())),0,-1))>21,BA49+7,IF(DAY(OFFSET(INDIRECT(ADDRESS(ROW(),COLUMN())),0,-1))<7,BA49+0,IF(AND(DAY(OFFSET(INDIRECT(ADDRESS(ROW(),COLUMN())),0,-1))>7,DAY(OFFSET(INDIRECT(ADDRESS(ROW(),COLUMN())),0,-1))<15),BA49+7,BA49+0)))","v":"2028-05-18"},null,"2028-05-16",{"$f":"IF(DAY(OFFSET(INDIRECT(ADDRESS(ROW(),COLUMN())),0,-1))>21,BD49+7,IF(DAY(OFFSET(INDIRECT(ADDRESS(ROW(),COLUMN())),0,-1))<7,BD49+0,IF(AND(DAY(OFFSET(INDIRECT(ADDRESS(ROW(),COLUMN())),0,-1))>7,DAY(OFFSET(INDIRECT(ADDRESS(ROW(),COLUMN())),0,-1))<15),BD49+7,BD49+0)))","v":"2028-05-16"},null,"2028-05-16",null,null,"2029-03-22",{"$f":"IF(DAY(OFFSET(INDIRECT(ADDRESS(ROW(),COLUMN())),0,-1))<15,BJ49+7,IF(DAY(OFFSET(INDIRECT(ADDRESS(ROW(),COLUMN())),0,-1))>21,BJ49-7,BJ49+0))","v":"2029-03-15"},null,"2028-10-17",{"$f":"IF(DAY(OFFSET(INDIRECT(ADDRESS(ROW(),COLUMN())),0,-1))<15,BM49+7,IF(DAY(OFFSET(INDIRECT(ADDRESS(ROW(),COLUMN())),0,-1))>21,BM49-7,BM49+0))","v":"2028-10-17"},null,"2028-09-26",{"$f":"IF(DAY(OFFSET(INDIRECT(ADDRESS(ROW(),COLUMN())),0,-1))<21,BP49+7,IF(DAY(OFFSET(INDIRECT(ADDRESS(ROW(),COLUMN())),0,-1))>28,BP49-7,BP49+0))","v":"2028-09-26"},{"$f":"IF(AND($B$8>=BS48,$B$8<=BS49),BS49,\"X\")","v":"X"},"2029-02-27","2029-04-18",null,"2028-10-17",{"$f":"IF(DAY(OFFSET(INDIRECT(ADDRESS(ROW(),COLUMN())),0,-1))<15,BV49+7,IF(DAY(OFFSET(INDIRECT(ADDRESS(ROW(),COLUMN())),0,-1))>21,BV49-7,BV49+0))","v":"2028-10-17"},null,"2028-05-16",{"$f":"IF(DAY(OFFSET(INDIRECT(ADDRESS(ROW(),COLUMN())),0,-1))>21,BY49+7,IF(DAY(OFFSET(INDIRECT(ADDRESS(ROW(),COLUMN())),0,-1))<7,BY49+0,IF(AND(DAY(OFFSET(INDIRECT(ADDRESS(ROW(),COLUMN())),0,-1))>7,DAY(OFFSET(INDIRECT(ADDRESS(ROW(),COLUMN())),0,-1))<15),BY49+7,BY49+0)))","v":"2028-05-16"},null,"2027-04-06",null,null,null,null,null,"2028-10-05",{"$f":"IF(DAY(OFFSET(INDIRECT(ADDRESS(ROW(),COLUMN())),0,-1))<7,CH49+0,IF(DAY(OFFSET(INDIRECT(ADDRESS(ROW(),COLUMN())),0,-1))>7,CH49-7,CH49+0))","v":"2028-10-05"},null,"2027-07-08",null,null,"2028-10-10",{"$f":"IF(DAY(OFFSET(INDIRECT(ADDRESS(ROW(),COLUMN())),0,-1))>21,CN49+7,IF(DAY(OFFSET(INDIRECT(ADDRESS(ROW(),COLUMN())),0,-1))<7,CN49+0,IF(AND(DAY(OFFSET(INDIRECT(ADDRESS(ROW(),COLUMN())),0,-1))>7,DAY(OFFSET(INDIRECT(ADDRESS(ROW(),COLUMN())),0,-1))<15),CN49+7,CN49+0)))","v":"2028-10-17"},null,"2028-10-02",{"$f":"IF(DAY(OFFSET(INDIRECT(ADDRESS(ROW(),COLUMN())),0,-1))<7,CQ49+0,IF(DAY(OFFSET(INDIRECT(ADDRESS(ROW(),COLUMN())),0,-1))>7,CQ49-7,CQ49+0))","v":"2028-10-02"},null,"2028-10-02",{"$f":"IF(DAY(OFFSET(INDIRECT(ADDRESS(ROW(),COLUMN())),0,-1))<7,CT49+0,IF(DAY(OFFSET(INDIRECT(ADDRESS(ROW(),COLUMN())),0,-1))>7,CT49-7,CT49+0))+3","v":"2028-10-05"},null,"2028-10-02",{"$f":"IF(DAY(OFFSET(INDIRECT(ADDRESS(ROW(),COLUMN())),0,-1))<8,CW49+7,CW49+0)","v":"2028-10-09"},null,"2028-10-16",{"$f":"IF(DAY(OFFSET(INDIRECT(ADDRESS(ROW(),COLUMN())),0,-1))<15,CZ49+7,IF(DAY(OFFSET(INDIRECT(ADDRESS(ROW(),COLUMN())),0,-1))>21,CZ49-7,CZ49+0))","v":"2028-10-16"},"X","2029-10-15","2029-12-04"]
[null,null,null,null,null,"Div 10","Town of Pineville",{"$f":"I34","v":"2028-08-14"},"Town of Pineville",0,14,0,null,"2028-06-05",{"$f":"IF(DAY(OFFSET(INDIRECT(ADDRESS(ROW(),COLUMN())),0,-1))>21,N50+7,IF(DAY(OFFSET(INDIRECT(ADDRESS(ROW(),COLUMN())),0,-1))<7,N50+0,IF(AND(DAY(OFFSET(INDIRECT(ADDRESS(ROW(),COLUMN())),0,-1))>7,DAY(OFFSET(INDIRECT(ADDRESS(ROW(),COLUMN())),0,-1))<15),N50+7,N50+0)))","v":"2028-06-05"},null,"2028-06-06",{"$f":"IF(DAY(OFFSET(INDIRECT(ADDRESS(ROW(),COLUMN())),0,-1))>21,Q50+7,IF(DAY(OFFSET(INDIRECT(ADDRESS(ROW(),COLUMN())),0,-1))<7,Q50+0,IF(AND(DAY(OFFSET(INDIRECT(ADDRESS(ROW(),COLUMN())),0,-1))>7,DAY(OFFSET(INDIRECT(ADDRESS(ROW(),COLUMN())),0,-1))<15),Q50+7,Q50+0)))","v":"2028-06-06"},null,"2028-11-07",{"$f":"IF(DAY(OFFSET(INDIRECT(ADDRESS(ROW(),COLUMN())),0,-1))>21,T50+7,IF(DAY(OFFSET(INDIRECT(ADDRESS(ROW(),COLUMN())),0,-1))<7,T50+0,IF(AND(DAY(OFFSET(INDIRECT(ADDRESS(ROW(),COLUMN())),0,-1))>7,DAY(OFFSET(INDIRECT(ADDRESS(ROW(),COLUMN())),0,-1))<15),T50+7,T50+0)))","v":"2028-11-07"},null,"2028-06-05",{"$f":"IF(DAY(OFFSET(INDIRECT(ADDRESS(ROW(),COLUMN())),0,-1))>21,W50+7,IF(DAY(OFFSET(INDIRECT(ADDRESS(ROW(),COLUMN())),0,-1))<7,W50+0,IF(AND(DAY(OFFSET(INDIRECT(ADDRESS(ROW(),COLUMN())),0,-1))>7,DAY(OFFSET(INDIRECT(ADDRESS(ROW(),COLUMN())),0,-1))<15),W50+7,W50+0)))","v":"2028-06-05"},null,"2028-11-09",{"$f":"IF(DAY(OFFSET(INDIRECT(ADDRESS(ROW(),COLUMN())),0,-1))<8,Z50+7,Z50+0)","v":"2028-11-09"},null,null,null,null,null,null,null,null,null,null,null,null,null,null,null,null,"2028-11-07",{"$f":"IF(DAY(OFFSET(INDIRECT(ADDRESS(ROW(),COLUMN())),0,-1))<8,AR50+7,AR50+0)","v":"2028-11-14"},null,"2028-06-05",{"$f":"IF(DAY(OFFSET(INDIRECT(ADDRESS(ROW(),COLUMN())),0,-1))>21,AU50+7,IF(DAY(OFFSET(INDIRECT(ADDRESS(ROW(),COLUMN())),0,-1))<7,AU50+0,IF(AND(DAY(OFFSET(INDIRECT(ADDRESS(ROW(),COLUMN())),0,-1))>7,DAY(OFFSET(INDIRECT(ADDRESS(ROW(),COLUMN())),0,-1))<15),AU50+7,AU50+0)))","v":"2028-06-05"},null,"2028-11-21",{"$f":"IF(DAY(OFFSET(INDIRECT(ADDRESS(ROW(),COLUMN())),0,-1))<16,AX50+7,AX50+0)","v":"2028-11-21"},null,"2028-06-01",{"$f":"IF(DAY(OFFSET(INDIRECT(ADDRESS(ROW(),COLUMN())),0,-1))>21,BA50+7,IF(DAY(OFFSET(INDIRECT(ADDRESS(ROW(),COLUMN())),0,-1))<7,BA50+0,IF(AND(DAY(OFFSET(INDIRECT(ADDRESS(ROW(),COLUMN())),0,-1))>7,DAY(OFFSET(INDIRECT(ADDRESS(ROW(),COLUMN())),0,-1))<15),BA50+7,BA50+0)))","v":"2028-06-01"},null,"2028-06-05",{"$f":"IF(DAY(OFFSET(INDIRECT(ADDRESS(ROW(),COLUMN())),0,-1))>21,BD50+7,IF(DAY(OFFSET(INDIRECT(ADDRESS(ROW(),COLUMN())),0,-1))<7,BD50+0,IF(AND(DAY(OFFSET(INDIRECT(ADDRESS(ROW(),COLUMN())),0,-1))>7,DAY(OFFSET(INDIRECT(ADDRESS(ROW(),COLUMN())),0,-1))<15),BD50+7,BD50+0)))","v":"2028-06-05"},null,"2028-05-30",null,null,"2029-04-19",{"$f":"IF(DAY(OFFSET(INDIRECT(ADDRESS(ROW(),COLUMN())),0,-1))<15,BJ50+7,IF(DAY(OFFSET(INDIRECT(ADDRESS(ROW(),COLUMN())),0,-1))>21,BJ50-7,BJ50+0))","v":"2029-04-19"},null,"2028-11-21",{"$f":"IF(DAY(OFFSET(INDIRECT(ADDRESS(ROW(),COLUMN())),0,-1))<15,BM50+7,IF(DAY(OFFSET(INDIRECT(ADDRESS(ROW(),COLUMN())),0,-1))>21,BM50-7,BM50+0))","v":"2028-11-21"},null,"2028-10-24",{"$f":"IF(DAY(OFFSET(INDIRECT(ADDRESS(ROW(),COLUMN())),0,-1))<21,BP50+7,IF(DAY(OFFSET(INDIRECT(ADDRESS(ROW(),COLUMN())),0,-1))>28,BP50-7,BP50+0))","v":"2028-10-24"},{"$f":"IF(AND($B$8>=BS49,$B$8<=BS50),BS50,\"X\")","v":"X"},"2029-02-28","2029-04-19",null,"2028-11-21",{"$f":"IF(DAY(OFFSET(INDIRECT(ADDRESS(ROW(),COLUMN())),0,-1))<15,BV50+7,IF(DAY(OFFSET(INDIRECT(ADDRESS(ROW(),COLUMN())),0,-1))>21,BV50-7,BV50+0))","v":"2028-11-21"},null,"2028-06-06",{"$f":"IF(DAY(OFFSET(INDIRECT(ADDRESS(ROW(),COLUMN())),0,-1))>21,BY50+7,IF(DAY(OFFSET(INDIRECT(ADDRESS(ROW(),COLUMN())),0,-1))<7,BY50+0,IF(AND(DAY(OFFSET(INDIRECT(ADDRESS(ROW(),COLUMN())),0,-1))>7,DAY(OFFSET(INDIRECT(ADDRESS(ROW(),COLUMN())),0,-1))<15),BY50+7,BY50+0)))","v":"2028-06-06"},null,null,null,null,null,null,null,"2028-11-02",{"$f":"IF(DAY(OFFSET(INDIRECT(ADDRESS(ROW(),COLUMN())),0,-1))<7,CH50+0,IF(DAY(OFFSET(INDIRECT(ADDRESS(ROW(),COLUMN())),0,-1))>7,CH50-7,CH50+0))","v":"2028-11-02"},null,null,null,null,"2028-11-07",{"$f":"IF(DAY(OFFSET(INDIRECT(ADDRESS(ROW(),COLUMN())),0,-1))>21,CN50+7,IF(DAY(OFFSET(INDIRECT(ADDRESS(ROW(),COLUMN())),0,-1))<7,CN50+0,IF(AND(DAY(OFFSET(INDIRECT(ADDRESS(ROW(),COLUMN())),0,-1))>7,DAY(OFFSET(INDIRECT(ADDRESS(ROW(),COLUMN())),0,-1))<15),CN50+7,CN50+0)))","v":"2028-11-07"},null,"2028-11-06",{"$f":"IF(DAY(OFFSET(INDIRECT(ADDRESS(ROW(),COLUMN())),0,-1))<7,CQ50+0,IF(DAY(OFFSET(INDIRECT(ADDRESS(ROW(),COLUMN())),0,-1))>7,CQ50-7,CQ50+0))","v":"2028-11-06"},null,"2028-11-06",{"$f":"IF(DAY(OFFSET(INDIRECT(ADDRESS(ROW(),COLUMN())),0,-1))<7,CT50+0,IF(DAY(OFFSET(INDIRECT(ADDRESS(ROW(),COLUMN())),0,-1))>7,CT50-7,CT50+0))+3","v":"2028-11-09"},null,"2028-11-06",{"$f":"IF(DAY(OFFSET(INDIRECT(ADDRESS(ROW(),COLUMN())),0,-1))<8,CW50+7,CW50+0)","v":"2028-11-13"},null,"2028-11-20",{"$f":"IF(DAY(OFFSET(INDIRECT(ADDRESS(ROW(),COLUMN())),0,-1))<15,CZ50+7,IF(DAY(OFFSET(INDIRECT(ADDRESS(ROW(),COLUMN())),0,-1))>21,CZ50-7,CZ50+0))","v":"2028-11-20"},"X","2029-11-06","2029-12-26"]
[null,null,null,null,null,"Div 10","Town of Waxhaw",{"$f":"AN40","v":"2028-08-22"},"Town of Waxhaw",10,7,30,null,"2028-06-19",{"$f":"IF(DAY(OFFSET(INDIRECT(ADDRESS(ROW(),COLUMN())),0,-1))>21,N51+7,IF(DAY(OFFSET(INDIRECT(ADDRESS(ROW(),COLUMN())),0,-1))<7,N51+0,IF(AND(DAY(OFFSET(INDIRECT(ADDRESS(ROW(),COLUMN())),0,-1))>7,DAY(OFFSET(INDIRECT(ADDRESS(ROW(),COLUMN())),0,-1))<15),N51+7,N51+0)))","v":"2028-06-19"},null,"2028-06-20",{"$f":"IF(DAY(OFFSET(INDIRECT(ADDRESS(ROW(),COLUMN())),0,-1))>21,Q51+7,IF(DAY(OFFSET(INDIRECT(ADDRESS(ROW(),COLUMN())),0,-1))<7,Q51+0,IF(AND(DAY(OFFSET(INDIRECT(ADDRESS(ROW(),COLUMN())),0,-1))>7,DAY(OFFSET(INDIRECT(ADDRESS(ROW(),COLUMN())),0,-1))<15),Q51+7,Q51+0)))","v":"2028-06-20"},null,"2028-12-12",{"$f":"IF(DAY(OFFSET(INDIRECT(ADDRESS(ROW(),COLUMN())),0,-1))>21,T51+7,IF(DAY(OFFSET(INDIRECT(ADDRESS(ROW(),COLUMN())),0,-1))<7,T51+0,IF(AND(DAY(OFFSET(INDIRECT(ADDRESS(ROW(),COLUMN())),0,-1))>7,DAY(OFFSET(INDIRECT(ADDRESS(ROW(),COLUMN())),0,-1))<15),T51+7,T51+0)))","v":"2028-12-19"},null,"2028-06-19",{"$f":"IF(DAY(OFFSET(INDIRECT(ADDRESS(ROW(),COLUMN())),0,-1))>21,W51+7,IF(DAY(OFFSET(INDIRECT(ADDRESS(ROW(),COLUMN())),0,-1))<7,W51+0,IF(AND(DAY(OFFSET(INDIRECT(ADDRESS(ROW(),COLUMN())),0,-1))>7,DAY(OFFSET(INDIRECT(ADDRESS(ROW(),COLUMN())),0,-1))<15),W51+7,W51+0)))","v":"2028-06-19"},null,"2028-12-14",{"$f":"IF(DAY(OFFSET(INDIRECT(ADDRESS(ROW(),COLUMN())),0,-1))<8,Z51+7,Z51+0)","v":"2028-12-14"},null,null,null,null,null,null,null,null,null,null,null,null,null,null,null,null,"2028-12-12",{"$f":"IF(DAY(OFFSET(INDIRECT(ADDRESS(ROW(),COLUMN())),0,-1))<8,AR51+7,AR51+0)","v":"2028-12-12"},null,"2028-06-19",{"$f":"IF(DAY(OFFSET(INDIRECT(ADDRESS(ROW(),COLUMN())),0,-1))>21,AU51+7,IF(DAY(OFFSET(INDIRECT(ADDRESS(ROW(),COLUMN())),0,-1))<7,AU51+0,IF(AND(DAY(OFFSET(INDIRECT(ADDRESS(ROW(),COLUMN())),0,-1))>7,DAY(OFFSET(INDIRECT(ADDRESS(ROW(),COLUMN())),0,-1))<15),AU51+7,AU51+0)))","v":"2028-06-19"},null,"2028-12-19",{"$f":"IF(DAY(OFFSET(INDIRECT(ADDRESS(ROW(),COLUMN())),0,-1))<16,AX51+7,AX51+0)","v":"2028-12-19"},null,"2028-06-15",{"$f":"IF(DAY(OFFSET(INDIRECT(ADDRESS(ROW(),COLUMN())),0,-1))>21,BA51+7,IF(DAY(OFFSET(INDIRECT(ADDRESS(ROW(),COLUMN())),0,-1))<7,BA51+0,IF(AND(DAY(OFFSET(INDIRECT(ADDRESS(ROW(),COLUMN())),0,-1))>7,DAY(OFFSET(INDIRECT(ADDRESS(ROW(),COLUMN())),0,-1))<15),BA51+7,BA51+0)))","v":"2028-06-15"},null,"2028-06-20",{"$f":"IF(DAY(OFFSET(INDIRECT(ADDRESS(ROW(),COLUMN())),0,-1))>21,BD51+7,IF(DAY(OFFSET(INDIRECT(ADDRESS(ROW(),COLUMN())),0,-1))<7,BD51+0,IF(AND(DAY(OFFSET(INDIRECT(ADDRESS(ROW(),COLUMN())),0,-1))>7,DAY(OFFSET(INDIRECT(ADDRESS(ROW(),COLUMN())),0,-1))<15),BD51+7,BD51+0)))","v":"2028-06-20"},null,"2028-06-13",null,null,"2029-05-17",{"$f":"IF(DAY(OFFSET(INDIRECT(ADDRESS(ROW(),COLUMN())),0,-1))<15,BJ51+7,IF(DAY(OFFSET(INDIRECT(ADDRESS(ROW(),COLUMN())),0,-1))>21,BJ51-7,BJ51+0))","v":"2029-05-17"},null,"2028-12-19",{"$f":"IF(DAY(OFFSET(INDIRECT(ADDRESS(ROW(),COLUMN())),0,-1))<15,BM51+7,IF(DAY(OFFSET(INDIRECT(ADDRESS(ROW(),COLUMN())),0,-1))>21,BM51-7,BM51+0))","v":"2028-12-19"},null,"2028-11-28",{"$f":"IF(DAY(OFFSET(INDIRECT(ADDRESS(ROW(),COLUMN())),0,-1))<21,BP51+7,IF(DAY(OFFSET(INDIRECT(ADDRESS(ROW(),COLUMN())),0,-1))>28,BP51-7,BP51+0))","v":"2028-11-28"},"X","2029-03-18","2029-05-07",null,"2028-12-19",{"$f":"IF(DAY(OFFSET(INDIRECT(ADDRESS(ROW(),COLUMN())),0,-1))<15,BV51+7,IF(DAY(OFFSET(INDIRECT(ADDRESS(ROW(),COLUMN())),0,-1))>21,BV51-7,BV51+0))","v":"2028-12-19"},null,"2028-06-20",{"$f":"IF(DAY(OFFSET(INDIRECT(ADDRESS(ROW(),COLUMN())),0,-1))>21,BY51+7,IF(DAY(OFFSET(INDIRECT(ADDRESS(ROW(),COLUMN())),0,-1))<7,BY51+0,IF(AND(DAY(OFFSET(INDIRECT(ADDRESS(ROW(),COLUMN())),0,-1))>7,DAY(OFFSET(INDIRECT(ADDRESS(ROW(),COLUMN())),0,-1))<15),BY51+7,BY51+0)))","v":"2028-06-20"},null,null,null,null,null,null,null,"2028-12-07",{"$f":"IF(DAY(OFFSET(INDIRECT(ADDRESS(ROW(),COLUMN())),0,-1))<7,CH51+0,IF(DAY(OFFSET(INDIRECT(ADDRESS(ROW(),COLUMN())),0,-1))>7,CH51-7,CH51+0))","v":"2028-12-07"},null,null,null,null,"2028-12-12",{"$f":"IF(DAY(OFFSET(INDIRECT(ADDRESS(ROW(),COLUMN())),0,-1))>21,CN51+7,IF(DAY(OFFSET(INDIRECT(ADDRESS(ROW(),COLUMN())),0,-1))<7,CN51+0,IF(AND(DAY(OFFSET(INDIRECT(ADDRESS(ROW(),COLUMN())),0,-1))>7,DAY(OFFSET(INDIRECT(ADDRESS(ROW(),COLUMN())),0,-1))<15),CN51+7,CN51+0)))","v":"2028-12-19"},null,"2028-12-04",{"$f":"IF(DAY(OFFSET(INDIRECT(ADDRESS(ROW(),COLUMN())),0,-1))<7,CQ51+0,IF(DAY(OFFSET(INDIRECT(ADDRESS(ROW(),COLUMN())),0,-1))>7,CQ51-7,CQ51+0))","v":"2028-12-04"},null,"2028-12-04",{"$f":"IF(DAY(OFFSET(INDIRECT(ADDRESS(ROW(),COLUMN())),0,-1))<7,CT51+0,IF(DAY(OFFSET(INDIRECT(ADDRESS(ROW(),COLUMN())),0,-1))>7,CT51-7,CT51+0))+3","v":"2028-12-07"},null,"2028-12-04",{"$f":"IF(DAY(OFFSET(INDIRECT(ADDRESS(ROW(),COLUMN())),0,-1))<8,CW51+7,CW51+0)","v":"2028-12-11"},null,"2028-12-18",{"$f":"IF(DAY(OFFSET(INDIRECT(ADDRESS(ROW(),COLUMN())),0,-1))<15,CZ51+7,IF(DAY(OFFSET(INDIRECT(ADDRESS(ROW(),COLUMN())),0,-1))>21,CZ51-7,CZ51+0))","v":"2028-12-18"},"X","2029-11-12","2030-01-01"]
[null,null,null,null,null,"Div 10","Town of Weddington",{"$f":"CV40","v":"2028-07-10"},"Town of Weddington",0,14,14,null,"2028-07-03",{"$f":"IF(DAY(OFFSET(INDIRECT(ADDRESS(ROW(),COLUMN())),0,-1))>21,N52+7,IF(DAY(OFFSET(INDIRECT(ADDRESS(ROW(),COLUMN())),0,-1))<7,N52+0,IF(AND(DAY(OFFSET(INDIRECT(ADDRESS(ROW(),COLUMN())),0,-1))>7,DAY(OFFSET(INDIRECT(ADDRESS(ROW(),COLUMN())),0,-1))<15),N52+7,N52+0)))","v":"2028-07-03"},null,"2028-07-04",{"$f":"IF(DAY(OFFSET(INDIRECT(ADDRESS(ROW(),COLUMN())),0,-1))>21,Q52+7,IF(DAY(OFFSET(INDIRECT(ADDRESS(ROW(),COLUMN())),0,-1))<7,Q52+0,IF(AND(DAY(OFFSET(INDIRECT(ADDRESS(ROW(),COLUMN())),0,-1))>7,DAY(OFFSET(INDIRECT(ADDRESS(ROW(),COLUMN())),0,-1))<15),Q52+7,Q52+0)))","v":"2028-07-04"},null,"2029-01-09",{"$f":"IF(DAY(OFFSET(INDIRECT(ADDRESS(ROW(),COLUMN())),0,-1))<8,T52+7,T52+0)","v":"2029-01-09"},null,"2028-07-03",{"$f":"IF(DAY(OFFSET(INDIRECT(ADDRESS(ROW(),COLUMN())),0,-1))>21,W52+7,IF(DAY(OFFSET(INDIRECT(ADDRESS(ROW(),COLUMN())),0,-1))<7,W52+0,IF(AND(DAY(OFFSET(INDIRECT(ADDRESS(ROW(),COLUMN())),0,-1))>7,DAY(OFFSET(INDIRECT(ADDRESS(ROW(),COLUMN())),0,-1))<15),W52+7,W52+0)))","v":"2028-07-03"},null,"2029-01-11",{"$f":"IF(DAY(OFFSET(INDIRECT(ADDRESS(ROW(),COLUMN())),0,-1))=15,Z52-7,Z52+0)","v":"2029-01-11"},null,null,null,null,null,null,null,null,null,null,null,null,null,null,null,null,"2029-01-09",{"$f":"IF(DAY(OFFSET(INDIRECT(ADDRESS(ROW(),COLUMN())),0,-1))<8,AR52+7,AR52+0)","v":"2029-01-09"},null,"2028-07-03",{"$f":"IF(DAY(OFFSET(INDIRECT(ADDRESS(ROW(),COLUMN())),0,-1))>21,AU52+7,IF(DAY(OFFSET(INDIRECT(ADDRESS(ROW(),COLUMN())),0,-1))<7,AU52+0,IF(AND(DAY(OFFSET(INDIRECT(ADDRESS(ROW(),COLUMN())),0,-1))>7,DAY(OFFSET(INDIRECT(ADDRESS(ROW(),COLUMN())),0,-1))<15),AU52+7,AU52+0)))","v":"2028-07-03"},null,"2029-01-16",{"$f":"IF(DAY(OFFSET(INDIRECT(ADDRESS(ROW(),COLUMN())),0,-1))<16,AX52+7,AX52+0)","v":"2029-01-16"},null,"2028-06-29",{"$f":"IF(DAY(OFFSET(INDIRECT(ADDRESS(ROW(),COLUMN())),0,-1))>21,BA52+7,IF(DAY(OFFSET(INDIRECT(ADDRESS(ROW(),COLUMN())),0,-1))<7,BA52+0,IF(AND(DAY(OFFSET(INDIRECT(ADDRESS(ROW(),COLUMN())),0,-1))>7,DAY(OFFSET(INDIRECT(ADDRESS(ROW(),COLUMN())),0,-1))<15),BA52+7,BA52+0)))","v":"2028-07-06"},null,"2028-07-03",{"$f":"IF(DAY(OFFSET(INDIRECT(ADDRESS(ROW(),COLUMN())),0,-1))>21,BD52+7,IF(DAY(OFFSET(INDIRECT(ADDRESS(ROW(),COLUMN())),0,-1))<7,BD52+0,IF(AND(DAY(OFFSET(INDIRECT(ADDRESS(ROW(),COLUMN())),0,-1))>7,DAY(OFFSET(INDIRECT(ADDRESS(ROW(),COLUMN())),0,-1))<15),BD52+7,BD52+0)))","v":"2028-07-03"},null,"2028-07-04",null,null,"2029-06-21",{"$f":"IF(DAY(OFFSET(INDIRECT(ADDRESS(ROW(),COLUMN())),0,-1))<15,BJ52+7,IF(DAY(OFFSET(INDIRECT(ADDRESS(ROW(),COLUMN())),0,-1))>21,BJ52-7,BJ52+0))","v":"2029-06-21"},null,"2029-01-16",{"$f":"IF(DAY(OFFSET(INDIRECT(ADDRESS(ROW(),COLUMN())),0,-1))<15,BM52+7,IF(DAY(OFFSET(INDIRECT(ADDRESS(ROW(),COLUMN())),0,-1))>21,BM52-7,BM52+0))","v":"2029-01-16"},null,"2028-12-26",{"$f":"IF(DAY(OFFSET(INDIRECT(ADDRESS(ROW(),COLUMN())),0,-1))<21,BP52+7,IF(DAY(OFFSET(INDIRECT(ADDRESS(ROW(),COLUMN())),0,-1))>28,BP52-7,BP52+0))","v":"2028-12-26"},"X","2029-03-27","2029-05-16",null,"2029-01-16",{"$f":"IF(DAY(OFFSET(INDIRECT(ADDRESS(ROW(),COLUMN())),0,-1))<15,BV52+7,IF(DAY(OFFSET(INDIRECT(ADDRESS(ROW(),COLUMN())),0,-1))>21,BV52-7,BV52+0))","v":"2029-01-16"},null,"2028-07-04",{"$f":"IF(DAY(OFFSET(INDIRECT(ADDRESS(ROW(),COLUMN())),0,-1))>21,BY52+7,IF(DAY(OFFSET(INDIRECT(ADDRESS(ROW(),COLUMN())),0,-1))<7,BY52+0,IF(AND(DAY(OFFSET(INDIRECT(ADDRESS(ROW(),COLUMN())),0,-1))>7,DAY(OFFSET(INDIRECT(ADDRESS(ROW(),COLUMN())),0,-1))<15),BY52+7,BY52+0)))","v":"2028-07-04"},null,"2027-04-20",null,null,null,null,null,"2029-01-04",{"$f":"IF(DAY(OFFSET(INDIRECT(ADDRESS(ROW(),COLUMN())),0,-1))<7,CH52+0,IF(DAY(OFFSET(INDIRECT(ADDRESS(ROW(),COLUMN())),0,-1))>7,CH52-7,CH52+0))","v":"2029-01-04"},null,"2027-08-05",null,null,"2029-01-09",{"$f":"IF(DAY(OFFSET(INDIRECT(ADDRESS(ROW(),COLUMN())),0,-1))<8,CN52+7,CN52+0)","v":"2029-01-09"},null,"2029-01-08",{"$f":"IF(DAY(OFFSET(INDIRECT(ADDRESS(ROW(),COLUMN())),0,-1))<7,CQ52+0,IF(DAY(OFFSET(INDIRECT(ADDRESS(ROW(),COLUMN())),0,-1))>7,CQ52-7,CQ52+0))","v":"2029-01-01"},null,"2029-01-08",{"$f":"IF(DAY(OFFSET(INDIRECT(ADDRESS(ROW(),COLUMN())),0,-1))<7,CT52+0,IF(DAY(OFFSET(INDIRECT(ADDRESS(ROW(),COLUMN())),0,-1))>7,CT52-7,CT52+0))+3","v":"2029-01-04"},null,"2029-01-08",{"$f":"IF(DAY(OFFSET(INDIRECT(ADDRESS(ROW(),COLUMN())),0,-1))<8,CW52+7,CW52+0)","v":"2029-01-08"},null,"2029-01-22",{"$f":"IF(DAY(OFFSET(INDIRECT(ADDRESS(ROW(),COLUMN())),0,-1))<15,CZ52+7,IF(DAY(OFFSET(INDIRECT(ADDRESS(ROW(),COLUMN())),0,-1))>21,CZ52-7,CZ52+0))","v":"2029-01-15"},"X","2029-12-04","2030-01-23"]
[null,null,null,null,null,"Div 10","Town of Cornelius",{"$f":"M40","v":"2028-08-21"},"Town of Cornelius",null,10,0,null,"2028-07-17",{"$f":"IF(DAY(OFFSET(INDIRECT(ADDRESS(ROW(),COLUMN())),0,-1))>21,N53+7,IF(DAY(OFFSET(INDIRECT(ADDRESS(ROW(),COLUMN())),0,-1))<7,N53+0,IF(AND(DAY(OFFSET(INDIRECT(ADDRESS(ROW(),COLUMN())),0,-1))>7,DAY(OFFSET(INDIRECT(ADDRESS(ROW(),COLUMN())),0,-1))<15),N53+7,N53+0)))","v":"2028-07-17"},null,"2028-07-18",{"$f":"IF(DAY(OFFSET(INDIRECT(ADDRESS(ROW(),COLUMN())),0,-1))>21,Q53+7,IF(DAY(OFFSET(INDIRECT(ADDRESS(ROW(),COLUMN())),0,-1))<7,Q53+0,IF(AND(DAY(OFFSET(INDIRECT(ADDRESS(ROW(),COLUMN())),0,-1))>7,DAY(OFFSET(INDIRECT(ADDRESS(ROW(),COLUMN())),0,-1))<15),Q53+7,Q53+0)))","v":"2028-07-18"},null,"2029-02-06",{"$f":"IF(DAY(OFFSET(INDIRECT(ADDRESS(ROW(),COLUMN())),0,-1))<8,T53+7,T53+0)","v":"2029-02-13"},null,"2028-07-17",{"$f":"IF(DAY(OFFSET(INDIRECT(ADDRESS(ROW(),COLUMN())),0,-1))>21,W53+7,IF(DAY(OFFSET(INDIRECT(ADDRESS(ROW(),COLUMN())),0,-1))<7,W53+0,IF(AND(DAY(OFFSET(INDIRECT(ADDRESS(ROW(),COLUMN())),0,-1))>7,DAY(OFFSET(INDIRECT(ADDRESS(ROW(),COLUMN())),0,-1))<15),W53+7,W53+0)))","v":"2028-07-17"},null,"2029-02-15",{"$f":"IF(DAY(OFFSET(INDIRECT(ADDRESS(ROW(),COLUMN())),0,-1))=15,Z53-7,Z53+0)","v":"2029-02-08"},null,null,null,null,null,null,null,null,null,null,null,null,null,null,null,null,"2029-02-06",{"$f":"IF(DAY(OFFSET(INDIRECT(ADDRESS(ROW(),COLUMN())),0,-1))<8,AR53+7,AR53+0)","v":"2029-02-13"},null,"2028-07-17",{"$f":"IF(DAY(OFFSET(INDIRECT(ADDRESS(ROW(),COLUMN())),0,-1))>21,AU53+7,IF(DAY(OFFSET(INDIRECT(ADDRESS(ROW(),COLUMN())),0,-1))<7,AU53+0,IF(AND(DAY(OFFSET(INDIRECT(ADDRESS(ROW(),COLUMN())),0,-1))>7,DAY(OFFSET(INDIRECT(ADDRESS(ROW(),COLUMN())),0,-1))<15),AU53+7,AU53+0)))","v":"2028-07-17"},null,"2029-02-20",{"$f":"IF(DAY(OFFSET(INDIRECT(ADDRESS(ROW(),COLUMN())),0,-1))<16,AX53+7,AX53+0)","v":"2029-02-20"},null,"2028-07-13",{"$f":"IF(DAY(OFFSET(INDIRECT(ADDRESS(ROW(),COLUMN())),0,-1))>21,BA53+7,IF(DAY(OFFSET(INDIRECT(ADDRESS(ROW(),COLUMN())),0,-1))<7,BA53+0,IF(AND(DAY(OFFSET(INDIRECT(ADDRESS(ROW(),COLUMN())),0,-1))>7,DAY(OFFSET(INDIRECT(ADDRESS(ROW(),COLUMN())),0,-1))<15),BA53+7,BA53+0)))","v":"2028-07-20"},null,"2028-07-18",{"$f":"IF(DAY(OFFSET(INDIRECT(ADDRESS(ROW(),COLUMN())),0,-1))>21,BD53+7,IF(DAY(OFFSET(INDIRECT(ADDRESS(ROW(),COLUMN())),0,-1))<7,BD53+0,IF(AND(DAY(OFFSET(INDIRECT(ADDRESS(ROW(),COLUMN())),0,-1))>7,DAY(OFFSET(INDIRECT(ADDRESS(ROW(),COLUMN())),0,-1))<15),BD53+7,BD53+0)))","v":"2028-07-18"},null,"2028-07-18",null,null,"2029-07-19",{"$f":"IF(DAY(OFFSET(INDIRECT(ADDRESS(ROW(),COLUMN())),0,-1))<15,BJ53+7,IF(DAY(OFFSET(INDIRECT(ADDRESS(ROW(),COLUMN())),0,-1))>21,BJ53-7,BJ53+0))","v":"2029-07-19"},null,"2029-02-20",{"$f":"IF(DAY(OFFSET(INDIRECT(ADDRESS(ROW(),COLUMN())),0,-1))<15,BM53+7,IF(DAY(OFFSET(INDIRECT(ADDRESS(ROW(),COLUMN())),0,-1))>21,BM53-7,BM53+0))","v":"2029-02-20"},null,"2029-01-23",{"$f":"IF(DAY(OFFSET(INDIRECT(ADDRESS(ROW(),COLUMN())),0,-1))<21,BP53+7,IF(DAY(OFFSET(INDIRECT(ADDRESS(ROW(),COLUMN())),0,-1))>28,BP53-7,BP53+0))","v":"2029-01-23"},"X","2029-03-28","2029-05-17",null,"2029-02-20",{"$f":"IF(DAY(OFFSET(INDIRECT(ADDRESS(ROW(),COLUMN())),0,-1))<15,BV53+7,IF(DAY(OFFSET(INDIRECT(ADDRESS(ROW(),COLUMN())),0,-1))>21,BV53-7,BV53+0))","v":"2029-02-20"},null,"2028-07-18",{"$f":"IF(DAY(OFFSET(INDIRECT(ADDRESS(ROW(),COLUMN())),0,-1))>21,BY53+7,IF(DAY(OFFSET(INDIRECT(ADDRESS(ROW(),COLUMN())),0,-1))<7,BY53+0,IF(AND(DAY(OFFSET(INDIRECT(ADDRESS(ROW(),COLUMN())),0,-1))>7,DAY(OFFSET(INDIRECT(ADDRESS(ROW(),COLUMN())),0,-1))<15),BY53+7,BY53+0)))","v":"2028-07-18"},null,null,null,null,null,null,null,"2029-02-08",{"$f":"IF(DAY(OFFSET(INDIRECT(ADDRESS(ROW(),COLUMN())),0,-1))<7,CH53+0,IF(DAY(OFFSET(INDIRECT(ADDRESS(ROW(),COLUMN())),0,-1))>7,CH53-7,CH53+0))","v":"2029-02-01"},null,null,null,null,"2029-02-06",{"$f":"IF(DAY(OFFSET(INDIRECT(ADDRESS(ROW(),COLUMN())),0,-1))<8,CN53+7,CN53+0)","v":"2029-02-13"},null,"2029-02-05",{"$f":"IF(DAY(OFFSET(INDIRECT(ADDRESS(ROW(),COLUMN())),0,-1))<7,CQ53+0,IF(DAY(OFFSET(INDIRECT(ADDRESS(ROW(),COLUMN())),0,-1))>7,CQ53-7,CQ53+0))","v":"2029-02-05"},null,"2029-02-05",{"$f":"IF(DAY(OFFSET(INDIRECT(ADDRESS(ROW(),COLUMN())),0,-1))<7,CT53+0,IF(DAY(OFFSET(INDIRECT(ADDRESS(ROW(),COLUMN())),0,-1))>7,CT53-7,CT53+0))+3","v":"2029-02-08"},null,"2029-02-05",null,null,"2029-02-19",{"$f":"IF(DAY(OFFSET(INDIRECT(ADDRESS(ROW(),COLUMN())),0,-1))<15,CZ53+7,IF(DAY(OFFSET(INDIRECT(ADDRESS(ROW(),COLUMN())),0,-1))>21,CZ53-7,CZ53+0))","v":"2029-02-19"},{"$f":"_xlfn.IFS($CY$3=$CZ$3,$DA$3,$CY$4=$CZ$4,$DA$4,$CY$5=$CZ$5,$DA$5,$CY$6=$CZ$6,$DA$6,$CY$7=$CZ$7,$DA$7,$CY$8=$CZ$8,$DA$8,$CY$9=$CZ$9,$DA$9,$CY$10=$CZ$10,$DA$10,$CY$11=$CZ$11,$DA$11,$CY$12=$CZ$12,$DA$12,$CY$13=$CZ$13,$DA$13,$CY$14=$CZ$14,$DA$14,$CY$15=$CZ$15,$DA$15,$CY$16=$CZ$16,$DA$16,$CY$17=$CZ$17,$DA$17,$CY$18=$CZ$18,$DA$18,$CY$19=$CZ$19,$DA$19,$CY$20=$CZ$20,$DA$20,$CY$21=$CZ$21,$DA$21,$CY$22=$CZ$22,$DA$22,$CY$23=$CZ$23,$DA$23,$CY$24=$CZ$24,$DA$24,$CY$25=$CZ$25,$DA$25,$CY$26=$CZ$26,$DA$26,$CY$27=$CZ$27,$DA$27,$CY$28=$CZ$28,$DA$28,$CY$29=$CZ$29,$DA$29,$CY$30=$CZ$30,$DA$30,$CY$31=$CZ$31,$DA$31,$CY$32=$CZ$32,$DA$32,$CY$33=$CZ$33,$DA$33,$CY$34=$CZ$34,$DA$34,$CY$35=$CZ$35,$DA$35,$CY$36=$CZ$36,$DA$36,$CY$37=$CZ$37,$DA$37,$CY$38=$CZ$38,$DA$38,$CY$39=$CZ$39,$DA$39)","v":"2028-04-17"}]
[null,null,null,null,null,"Div 14","Hendersonville",{"$f":"CG40","v":"2028-09-07"},"Hendersonville",0,14,50,null,"2028-07-31",{"$f":"IF(DAY(OFFSET(INDIRECT(ADDRESS(ROW(),COLUMN())),0,-1))>21,N54+7,IF(DAY(OFFSET(INDIRECT(ADDRESS(ROW(),COLUMN())),0,-1))<7,N54+0,IF(AND(DAY(OFFSET(INDIRECT(ADDRESS(ROW(),COLUMN())),0,-1))>7,DAY(OFFSET(INDIRECT(ADDRESS(ROW(),COLUMN())),0,-1))<15),N54+7,N54+0)))","v":"2028-08-07"},null,"2028-08-01",{"$f":"IF(DAY(OFFSET(INDIRECT(ADDRESS(ROW(),COLUMN())),0,-1))>21,Q54+7,IF(DAY(OFFSET(INDIRECT(ADDRESS(ROW(),COLUMN())),0,-1))<7,Q54+0,IF(AND(DAY(OFFSET(INDIRECT(ADDRESS(ROW(),COLUMN())),0,-1))>7,DAY(OFFSET(INDIRECT(ADDRESS(ROW(),COLUMN())),0,-1))<15),Q54+7,Q54+0)))","v":"2028-08-01"},null,"2029-03-06",{"$f":"IF(DAY(OFFSET(INDIRECT(ADDRESS(ROW(),COLUMN())),0,-1))<8,T54+7,T54+0)","v":"2029-03-13"},null,"2028-07-31",{"$f":"IF(DAY(OFFSET(INDIRECT(ADDRESS(ROW(),COLUMN())),0,-1))>21,W54+7,IF(DAY(OFFSET(INDIRECT(ADDRESS(ROW(),COLUMN())),0,-1))<7,W54+0,IF(AND(DAY(OFFSET(INDIRECT(ADDRESS(ROW(),COLUMN())),0,-1))>7,DAY(OFFSET(INDIRECT(ADDRESS(ROW(),COLUMN())),0,-1))<15),W54+7,W54+0)))","v":"2028-08-07"},null,"2029-03-15",{"$f":"IF(DAY(OFFSET(INDIRECT(ADDRESS(ROW(),COLUMN())),0,-1))=15,Z54-7,Z54+0)","v":"2029-03-08"},null,null,null,null,null,null,null,null,null,null,null,null,null,null,null,null,"2029-03-06",{"$f":"IF(DAY(OFFSET(INDIRECT(ADDRESS(ROW(),COLUMN())),0,-1))<8,AR54+7,AR54+0)","v":"2029-03-13"},null,"2028-07-31",{"$f":"IF(DAY(OFFSET(INDIRECT(ADDRESS(ROW(),COLUMN())),0,-1))>21,AU54+7,IF(DAY(OFFSET(INDIRECT(ADDRESS(ROW(),COLUMN())),0,-1))<7,AU54+0,IF(AND(DAY(OFFSET(INDIRECT(ADDRESS(ROW(),COLUMN())),0,-1))>7,DAY(OFFSET(INDIRECT(ADDRESS(ROW(),COLUMN())),0,-1))<15),AU54+7,AU54+0)))","v":"2028-08-07"},null,"2029-03-20",{"$f":"IF(DAY(OFFSET(INDIRECT(ADDRESS(ROW(),COLUMN())),0,-1))<16,AX54+7,AX54+0)","v":"2029-03-20"},null,"2028-08-03",{"$f":"IF(DAY(OFFSET(INDIRECT(ADDRESS(ROW(),COLUMN())),0,-1))>21,BA54+7,IF(DAY(OFFSET(INDIRECT(ADDRESS(ROW(),COLUMN())),0,-1))<7,BA54+0,IF(AND(DAY(OFFSET(INDIRECT(ADDRESS(ROW(),COLUMN())),0,-1))>7,DAY(OFFSET(INDIRECT(ADDRESS(ROW(),COLUMN())),0,-1))<15),BA54+7,BA54+0)))","v":"2028-08-03"},null,"2028-07-31",{"$f":"IF(DAY(OFFSET(INDIRECT(ADDRESS(ROW(),COLUMN())),0,-1))>21,BD54+7,IF(DAY(OFFSET(INDIRECT(ADDRESS(ROW(),COLUMN())),0,-1))<7,BD54+0,IF(AND(DAY(OFFSET(INDIRECT(ADDRESS(ROW(),COLUMN())),0,-1))>7,DAY(OFFSET(INDIRECT(ADDRESS(ROW(),COLUMN())),0,-1))<15),BD54+7,BD54+0)))","v":"2028-08-07"},null,"2028-08-01",null,null,"2029-08-16",{"$f":"IF(DAY(OFFSET(INDIRECT(ADDRESS(ROW(),COLUMN())),0,-1))<15,BJ54+7,IF(DAY(OFFSET(INDIRECT(ADDRESS(ROW(),COLUMN())),0,-1))>21,BJ54-7,BJ54+0))","v":"2029-08-16"},null,"2029-03-20",{"$f":"IF(DAY(OFFSET(INDIRECT(ADDRESS(ROW(),COLUMN())),0,-1))<15,BM54+7,IF(DAY(OFFSET(INDIRECT(ADDRESS(ROW(),COLUMN())),0,-1))>21,BM54-7,BM54+0))","v":"2029-03-20"},null,"2029-02-27",{"$f":"IF(DAY(OFFSET(INDIRECT(ADDRESS(ROW(),COLUMN())),0,-1))<21,BP54+7,IF(DAY(OFFSET(INDIRECT(ADDRESS(ROW(),COLUMN())),0,-1))>28,BP54-7,BP54+0))","v":"2029-02-27"},"X","2029-04-15","2029-06-04",null,"2029-03-20",{"$f":"IF(DAY(OFFSET(INDIRECT(ADDRESS(ROW(),COLUMN())),0,-1))<15,BV54+7,IF(DAY(OFFSET(INDIRECT(ADDRESS(ROW(),COLUMN())),0,-1))>21,BV54-7,BV54+0))","v":"2029-03-20"},null,"2028-08-01",{"$f":"IF(DAY(OFFSET(INDIRECT(ADDRESS(ROW(),COLUMN())),0,-1))>21,BY54+7,IF(DAY(OFFSET(INDIRECT(ADDRESS(ROW(),COLUMN())),0,-1))<7,BY54+0,IF(AND(DAY(OFFSET(INDIRECT(ADDRESS(ROW(),COLUMN())),0,-1))>7,DAY(OFFSET(INDIRECT(ADDRESS(ROW(),COLUMN())),0,-1))<15),BY54+7,BY54+0)))","v":"2028-08-01"},null,"2027-05-04",null,null,null,null,null,"2029-03-08",{"$f":"IF(DAY(OFFSET(INDIRECT(ADDRESS(ROW(),COLUMN())),0,-1))<7,CH54+0,IF(DAY(OFFSET(INDIRECT(ADDRESS(ROW(),COLUMN())),0,-1))>7,CH54-7,CH54+0))","v":"2029-03-01"},null,"2027-09-02",null,null,"2029-03-06",{"$f":"IF(DAY(OFFSET(INDIRECT(ADDRESS(ROW(),COLUMN())),0,-1))<8,CN54+7,CN54+0)","v":"2029-03-13"},null,"2029-03-05",{"$f":"IF(DAY(OFFSET(INDIRECT(ADDRESS(ROW(),COLUMN())),0,-1))<7,CQ54+0,IF(DAY(OFFSET(INDIRECT(ADDRESS(ROW(),COLUMN())),0,-1))>7,CQ54-7,CQ54+0))","v":"2029-03-05"},null,"2029-03-05",{"$f":"IF(DAY(OFFSET(INDIRECT(ADDRESS(ROW(),COLUMN())),0,-1))<7,CT54+0,IF(DAY(OFFSET(INDIRECT(ADDRESS(ROW(),COLUMN())),0,-1))>7,CT54-7,CT54+0))+3","v":"2029-03-08"},null,"2029-03-05",{"$f":"IF(DAY(OFFSET(INDIRECT(ADDRESS(ROW(),COLUMN())),0,-1))<8,CW54+7,CW54+0)","v":"2029-03-12"},null,"2029-03-19",{"$f":"IF(DAY(OFFSET(INDIRECT(ADDRESS(ROW(),COLUMN())),0,-1))<15,CZ54+7,IF(DAY(OFFSET(INDIRECT(ADDRESS(ROW(),COLUMN())),0,-1))>21,CZ54-7,CZ54+0))","v":"2029-03-19"}]
[null,null,null,null,null,"Div 14","Waynesville",{"$f":"AN40","v":"2028-08-22"},"Waynesville",30,14,14,null,"2028-08-14",{"$f":"IF(DAY(OFFSET(INDIRECT(ADDRESS(ROW(),COLUMN())),0,-1))>21,N55+7,IF(DAY(OFFSET(INDIRECT(ADDRESS(ROW(),COLUMN())),0,-1))<7,N55+0,IF(AND(DAY(OFFSET(INDIRECT(ADDRESS(ROW(),COLUMN())),0,-1))>7,DAY(OFFSET(INDIRECT(ADDRESS(ROW(),COLUMN())),0,-1))<15),N55+7,N55+0)))","v":"2028-08-21"},null,"2028-08-15",{"$f":"IF(DAY(OFFSET(INDIRECT(ADDRESS(ROW(),COLUMN())),0,-1))>21,Q55+7,IF(DAY(OFFSET(INDIRECT(ADDRESS(ROW(),COLUMN())),0,-1))<7,Q55+0,IF(AND(DAY(OFFSET(INDIRECT(ADDRESS(ROW(),COLUMN())),0,-1))>7,DAY(OFFSET(INDIRECT(ADDRESS(ROW(),COLUMN())),0,-1))<15),Q55+7,Q55+0)))","v":"2028-08-15"},null,"2029-04-10",{"$f":"IF(DAY(OFFSET(INDIRECT(ADDRESS(ROW(),COLUMN())),0,-1))<8,T55+7,T55+0)","v":"2029-04-10"},null,"2028-08-14",{"$f":"IF(DAY(OFFSET(INDIRECT(ADDRESS(ROW(),COLUMN())),0,-1))>21,W55+7,IF(DAY(OFFSET(INDIRECT(ADDRESS(ROW(),COLUMN())),0,-1))<7,W55+0,IF(AND(DAY(OFFSET(INDIRECT(ADDRESS(ROW(),COLUMN())),0,-1))>7,DAY(OFFSET(INDIRECT(ADDRESS(ROW(),COLUMN())),0,-1))<15),W55+7,W55+0)))","v":"2028-08-21"},null,"2029-04-12",{"$f":"IF(DAY(OFFSET(INDIRECT(ADDRESS(ROW(),COLUMN())),0,-1))=15,Z55-7,Z55+0)","v":"2029-04-12"},null,null,null,null,null,null,null,null,null,null,null,null,null,null,null,null,"2029-04-10",{"$f":"IF(DAY(OFFSET(INDIRECT(ADDRESS(ROW(),COLUMN())),0,-1))<8,AR55+7,AR55+0)","v":"2029-04-10"},null,"2028-08-14",{"$f":"IF(DAY(OFFSET(INDIRECT(ADDRESS(ROW(),COLUMN())),0,-1))>21,AU55+7,IF(DAY(OFFSET(INDIRECT(ADDRESS(ROW(),COLUMN())),0,-1))<7,AU55+0,IF(AND(DAY(OFFSET(INDIRECT(ADDRESS(ROW(),COLUMN())),0,-1))>7,DAY(OFFSET(INDIRECT(ADDRESS(ROW(),COLUMN())),0,-1))<15),AU55+7,AU55+0)))","v":"2028-08-21"},null,"2029-04-17",{"$f":"IF(DAY(OFFSET(INDIRECT(ADDRESS(ROW(),COLUMN())),0,-1))<16,AX55+7,AX55+0)","v":"2029-04-17"},null,"2028-08-17",{"$f":"IF(DAY(OFFSET(INDIRECT(ADDRESS(ROW(),COLUMN())),0,-1))>21,BA55+7,IF(DAY(OFFSET(INDIRECT(ADDRESS(ROW(),COLUMN())),0,-1))<7,BA55+0,IF(AND(DAY(OFFSET(INDIRECT(ADDRESS(ROW(),COLUMN())),0,-1))>7,DAY(OFFSET(INDIRECT(ADDRESS(ROW(),COLUMN())),0,-1))<15),BA55+7,BA55+0)))","v":"2028-08-17"},null,"2028-08-15",{"$f":"IF(DAY(OFFSET(INDIRECT(ADDRESS(ROW(),COLUMN())),0,-1))>21,BD55+7,IF(DAY(OFFSET(INDIRECT(ADDRESS(ROW(),COLUMN())),0,-1))<7,BD55+0,IF(AND(DAY(OFFSET(INDIRECT(ADDRESS(ROW(),COLUMN())),0,-1))>7,DAY(OFFSET(INDIRECT(ADDRESS(ROW(),COLUMN())),0,-1))<15),BD55+7,BD55+0)))","v":"2028-08-15"},null,"2028-08-15",null,null,"2029-09-20",{"$f":"IF(DAY(OFFSET(INDIRECT(ADDRESS(ROW(),COLUMN())),0,-1))<15,BJ55+7,IF(DAY(OFFSET(INDIRECT(ADDRESS(ROW(),COLUMN())),0,-1))>21,BJ55-7,BJ55+0))","v":"2029-09-20"},null,"2029-04-17",{"$f":"IF(DAY(OFFSET(INDIRECT(ADDRESS(ROW(),COLUMN())),0,-1))<15,BM55+7,IF(DAY(OFFSET(INDIRECT(ADDRESS(ROW(),COLUMN())),0,-1))>21,BM55-7,BM55+0))","v":"2029-04-17"},null,"2029-03-27",{"$f":"IF(DAY(OFFSET(INDIRECT(ADDRESS(ROW(),COLUMN())),0,-1))<21,BP55+7,IF(DAY(OFFSET(INDIRECT(ADDRESS(ROW(),COLUMN())),0,-1))>28,BP55-7,BP55+0))","v":"2029-03-27"},{"$f":"_xlfn.IFS($BR$3=$BS$3,$BT$3,$BR$4=$BS$4,$BT$4,$BR$5=$BS$5,$BT$5,$BR$6=$BS$6,$BT$6,$BR$7=$BS$7,$BT$7,$BR$8=$BS$8,$BT$8,$BR$9=$BS$9,$BT$9,$BR$10=$BS$10,$BT$10,$BR$11=$BS$11,$BT$11,$BR$12=$BS$12,$BT$12,$BR$13=$BS$13,$BT$13,$BR$14=$BS$14,$BT$14,$BR$15=$BS$15,$BT$15,$BR$16=$BS$16,$BT$16,$BR$17=$BS$17,$BT$17,$BR$18=$BS$18,$BT$18,$BR$19=$BS$19,$BT$19,$BR$20=$BS$20,$BT$20,$BR$21=$BS$21,$BT$21,$BR$22=$BS$22,$BT$22,$BR$23=$BS$23,$BT$23,$BR$24=$BS$24,$BT$24,$BR$25=$BS$25,$BT$25,$BR$26=$BS$26,$BT$26,$BR$27=$BS$27,$BT$27,$BR$28=$BS$28,$BT$28,$BR$29=$BS$29,$BT$29,$BR$30=$BS$30,$BT$30,$BR$31=$BS$31,$BT$31,$BR$32=$BS$32,$BT$32,$BR$33=$BS$33,$BT$33,$BR$34=$BS$34,$BT$34,$BR$35=$BS$35,$BT$35,$BR$36=$BS$36,$BT$36,$BR$37=$BS$37,$BT$37,$BR$38=$BS$38,$BT$38,$BR$39=$BS$39,$BT$39,$BR$40=$BS$40,$BT$40,$BR$41=$BS$41,$BT$41,$BR$42=$BS$42,$BT$42,$BR$43=$BS$43,$BT$43,$BR$44=$BS$44,$BT$44,$BR$45=$BS$45,$BT$45,$BR$46=$BS$46,$BT$46,$BR$47=$BS$47,$BT$47,$BR$48=$BS$48,$BT$48,$BR$49=$BS$49,$BT$49,$BR$50=$BS$50,$BT$50,$BR$51=$BS$51,$BT$51,$BR$52=$BS$52,$BT$52,$BR$53=$BS$53,$BT$53,$BR$54=$BS$54,$BT$54)","v":"2028-08-16"},"2028-01-03",{"$f":"IF(DAY(OFFSET(INDIRECT(ADDRESS(ROW(),COLUMN())),0,-1))>21,BS55+7,IF(DAY(OFFSET(INDIRECT(ADDRESS(ROW(),COLUMN())),0,-1))<7,BS55+0,IF(AND(DAY(OFFSET(INDIRECT(ADDRESS(ROW(),COLUMN())),0,-1))>7,DAY(OFFSET(INDIRECT(ADDRESS(ROW(),COLUMN())),0,-1))<15),BS55+7,BS55+0)))","v":"2028-01-03"},null,"2029-04-17",{"$f":"IF(DAY(OFFSET(INDIRECT(ADDRESS(ROW(),COLUMN())),0,-1))<15,BV55+7,IF(DAY(OFFSET(INDIRECT(ADDRESS(ROW(),COLUMN())),0,-1))>21,BV55-7,BV55+0))","v":"2029-04-17"},null,"2028-08-15",{"$f":"IF(DAY(OFFSET(INDIRECT(ADDRESS(ROW(),COLUMN())),0,-1))>21,BY55+7,IF(DAY(OFFSET(INDIRECT(ADDRESS(ROW(),COLUMN())),0,-1))<7,BY55+0,IF(AND(DAY(OFFSET(INDIRECT(ADDRESS(ROW(),COLUMN())),0,-1))>7,DAY(OFFSET(INDIRECT(ADDRESS(ROW(),COLUMN())),0,-1))<15),BY55+7,BY55+0)))","v":"2028-08-15"},null,"2027-05-18",null,null,null,null,null,"2029-04-05",{"$f":"IF(DAY(OFFSET(INDIRECT(ADDRESS(ROW(),COLUMN())),0,-1))<7,CH55+0,IF(DAY(OFFSET(INDIRECT(ADDRESS(ROW(),COLUMN())),0,-1))>7,CH55-7,CH55+0))","v":"2029-04-05"},null,"2027-10-07",null,null,"2029-04-10",{"$f":"IF(DAY(OFFSET(INDIRECT(ADDRESS(ROW(),COLUMN())),0,-1))<8,CN55+7,CN55+0)","v":"2029-04-10"},null,"2029-04-02",{"$f":"IF(DAY(OFFSET(INDIRECT(ADDRESS(ROW(),COLUMN())),0,-1))<7,CQ55+0,IF(DAY(OFFSET(INDIRECT(ADDRESS(ROW(),COLUMN())),0,-1))>7,CQ55-7,CQ55+0))","v":"2029-04-02"},null,"2029-04-02",{"$f":"IF(DAY(OFFSET(INDIRECT(ADDRESS(ROW(),COLUMN())),0,-1))<7,CT55+0,IF(DAY(OFFSET(INDIRECT(ADDRESS(ROW(),COLUMN())),0,-1))>7,CT55-7,CT55+0))+3","v":"2029-04-05"},null,"2029-04-02",{"$f":"IF(DAY(OFFSET(INDIRECT(ADDRESS(ROW(),COLUMN())),0,-1))<8,CW55+7,CW55+0)","v":"2029-04-09"},null,"2029-04-16",{"$f":"IF(DAY(OFFSET(INDIRECT(ADDRESS(ROW(),COLUMN())),0,-1))<15,CZ55+7,IF(DAY(OFFSET(INDIRECT(ADDRESS(ROW(),COLUMN())),0,-1))>21,CZ55-7,CZ55+0))","v":"2029-04-16"}]
[null,null,null,null,null,"Div 13","City of Morganton",{"$f":"CP40","v":"2028-09-04"},"City of Morganton",0,14,7,null,"2028-09-04",{"$f":"IF(DAY(OFFSET(INDIRECT(ADDRESS(ROW(),COLUMN())),0,-1))>21,N56+7,IF(DAY(OFFSET(INDIRECT(ADDRESS(ROW(),COLUMN())),0,-1))<7,N56+0,IF(AND(DAY(OFFSET(INDIRECT(ADDRESS(ROW(),COLUMN())),0,-1))>7,DAY(OFFSET(INDIRECT(ADDRESS(ROW(),COLUMN())),0,-1))<15),N56+7,N56+0)))","v":"2028-09-04"},null,"2028-09-05",{"$f":"IF(DAY(OFFSET(INDIRECT(ADDRESS(ROW(),COLUMN())),0,-1))>21,Q56+7,IF(DAY(OFFSET(INDIRECT(ADDRESS(ROW(),COLUMN())),0,-1))<7,Q56+0,IF(AND(DAY(OFFSET(INDIRECT(ADDRESS(ROW(),COLUMN())),0,-1))>7,DAY(OFFSET(INDIRECT(ADDRESS(ROW(),COLUMN())),0,-1))<15),Q56+7,Q56+0)))","v":"2028-09-05"},null,"2029-05-08",{"$f":"IF(DAY(OFFSET(INDIRECT(ADDRESS(ROW(),COLUMN())),0,-1))<8,T56+7,T56+0)","v":"2029-05-08"},null,"2028-09-04",{"$f":"IF(DAY(OFFSET(INDIRECT(ADDRESS(ROW(),COLUMN())),0,-1))>21,W56+7,IF(DAY(OFFSET(INDIRECT(ADDRESS(ROW(),COLUMN())),0,-1))<7,W56+0,IF(AND(DAY(OFFSET(INDIRECT(ADDRESS(ROW(),COLUMN())),0,-1))>7,DAY(OFFSET(INDIRECT(ADDRESS(ROW(),COLUMN())),0,-1))<15),W56+7,W56+0)))","v":"2028-09-04"},null,"2029-05-10",{"$f":"IF(DAY(OFFSET(INDIRECT(ADDRESS(ROW(),COLUMN())),0,-1))=15,Z56-7,Z56+0)","v":"2029-05-10"},null,null,null,null,null,null,null,null,null,null,null,null,null,null,null,null,"2029-05-08",{"$f":"IF(DAY(OFFSET(INDIRECT(ADDRESS(ROW(),COLUMN())),0,-1))<8,AR56+7,AR56+0)","v":"2029-05-08"},null,"2028-09-04",{"$f":"IF(DAY(OFFSET(INDIRECT(ADDRESS(ROW(),COLUMN())),0,-1))>21,AU56+7,IF(DAY(OFFSET(INDIRECT(ADDRESS(ROW(),COLUMN())),0,-1))<7,AU56+0,IF(AND(DAY(OFFSET(INDIRECT(ADDRESS(ROW(),COLUMN())),0,-1))>7,DAY(OFFSET(INDIRECT(ADDRESS(ROW(),COLUMN())),0,-1))<15),AU56+7,AU56+0)))","v":"2028-09-04"},null,"2029-05-15",{"$f":"IF(DAY(OFFSET(INDIRECT(ADDRESS(ROW(),COLUMN())),0,-1))<16,AX56+7,AX56+0)","v":"2029-05-22"},null,"2028-08-31",{"$f":"IF(DAY(OFFSET(INDIRECT(ADDRESS(ROW(),COLUMN())),0,-1))>21,BA56+7,IF(DAY(OFFSET(INDIRECT(ADDRESS(ROW(),COLUMN())),0,-1))<7,BA56+0,IF(AND(DAY(OFFSET(INDIRECT(ADDRESS(ROW(),COLUMN())),0,-1))>7,DAY(OFFSET(INDIRECT(ADDRESS(ROW(),COLUMN())),0,-1))<15),BA56+7,BA56+0)))","v":"2028-09-07"},null,"2028-09-04",{"$f":"IF(DAY(OFFSET(INDIRECT(ADDRESS(ROW(),COLUMN())),0,-1))>21,BD56+7,IF(DAY(OFFSET(INDIRECT(ADDRESS(ROW(),COLUMN())),0,-1))<7,BD56+0,IF(AND(DAY(OFFSET(INDIRECT(ADDRESS(ROW(),COLUMN())),0,-1))>7,DAY(OFFSET(INDIRECT(ADDRESS(ROW(),COLUMN())),0,-1))<15),BD56+7,BD56+0)))","v":"2028-09-04"},null,"2028-09-05",null,null,"2029-10-18",{"$f":"IF(DAY(OFFSET(INDIRECT(ADDRESS(ROW(),COLUMN())),0,-1))<15,BJ56+7,IF(DAY(OFFSET(INDIRECT(ADDRESS(ROW(),COLUMN())),0,-1))>21,BJ56-7,BJ56+0))","v":"2029-10-18"},null,"2029-05-22",{"$f":"IF(DAY(OFFSET(INDIRECT(ADDRESS(ROW(),COLUMN())),0,-1))<15,BM56+7,IF(DAY(OFFSET(INDIRECT(ADDRESS(ROW(),COLUMN())),0,-1))>21,BM56-7,BM56+0))","v":"2029-05-15"},null,"2029-04-24",{"$f":"IF(DAY(OFFSET(INDIRECT(ADDRESS(ROW(),COLUMN())),0,-1))<21,BP56+7,IF(DAY(OFFSET(INDIRECT(ADDRESS(ROW(),COLUMN())),0,-1))>28,BP56-7,BP56+0))","v":"2029-04-24"},null,"2028-01-17",{"$f":"IF((DAY(BS56))<DAY(13),BS56+10,IF((DAY(BS56))>=DAY(20),BS56-5,BS56+2))","v":"2028-01-19"},null,"2029-05-22",{"$f":"IF(DAY(OFFSET(INDIRECT(ADDRESS(ROW(),COLUMN())),0,-1))<15,BV56+7,IF(DAY(OFFSET(INDIRECT(ADDRESS(ROW(),COLUMN())),0,-1))>21,BV56-7,BV56+0))","v":"2029-05-15"},null,"2028-09-05",{"$f":"IF(DAY(OFFSET(INDIRECT(ADDRESS(ROW(),COLUMN())),0,-1))>21,BY56+7,IF(DAY(OFFSET(INDIRECT(ADDRESS(ROW(),COLUMN())),0,-1))<7,BY56+0,IF(AND(DAY(OFFSET(INDIRECT(ADDRESS(ROW(),COLUMN())),0,-1))>7,DAY(OFFSET(INDIRECT(ADDRESS(ROW(),COLUMN())),0,-1))<15),BY56+7,BY56+0)))","v":"2028-09-05"},null,"2027-06-01",null,null,null,null,null,"2029-05-03",{"$f":"IF(DAY(OFFSET(INDIRECT(ADDRESS(ROW(),COLUMN())),0,-1))<7,CH56+0,IF(DAY(OFFSET(INDIRECT(ADDRESS(ROW(),COLUMN())),0,-1))>7,CH56-7,CH56+0))","v":"2029-05-03"},null,"2027-11-04",null,null,"2029-05-08",{"$f":"IF(DAY(OFFSET(INDIRECT(ADDRESS(ROW(),COLUMN())),0,-1))<8,CN56+7,CN56+0)","v":"2029-05-08"},null,"2029-05-07",{"$f":"IF(DAY(OFFSET(INDIRECT(ADDRESS(ROW(),COLUMN())),0,-1))<7,CQ56+0,IF(DAY(OFFSET(INDIRECT(ADDRESS(ROW(),COLUMN())),0,-1))>7,CQ56-7,CQ56+0))","v":"2029-05-07"},null,"2029-05-07",{"$f":"IF(DAY(OFFSET(INDIRECT(ADDRESS(ROW(),COLUMN())),0,-1))<7,CT56+0,IF(DAY(OFFSET(INDIRECT(ADDRESS(ROW(),COLUMN())),0,-1))>7,CT56-7,CT56+0))+3","v":"2029-05-10"},null,"2029-05-07",{"$f":"IF(DAY(OFFSET(INDIRECT(ADDRESS(ROW(),COLUMN())),0,-1))<8,CW56+7,CW56+0)","v":"2029-05-14"},null,"2029-05-21",{"$f":"IF(DAY(OFFSET(INDIRECT(ADDRESS(ROW(),COLUMN())),0,-1))<15,CZ56+7,IF(DAY(OFFSET(INDIRECT(ADDRESS(ROW(),COLUMN())),0,-1))>21,CZ56-7,CZ56+0))","v":"2029-05-21"}]
[null,null,null,null,null,"Div 13","City of Asheville",{"$f":"AN40","v":"2028-08-22"},"City of Asheville",0,30,14,null,"2028-09-18",{"$f":"IF(DAY(OFFSET(INDIRECT(ADDRESS(ROW(),COLUMN())),0,-1))>21,N57+7,IF(DAY(OFFSET(INDIRECT(ADDRESS(ROW(),COLUMN())),0,-1))<7,N57+0,IF(AND(DAY(OFFSET(INDIRECT(ADDRESS(ROW(),COLUMN())),0,-1))>7,DAY(OFFSET(INDIRECT(ADDRESS(ROW(),COLUMN())),0,-1))<15),N57+7,N57+0)))","v":"2028-09-18"},null,"2028-09-19",{"$f":"IF(DAY(OFFSET(INDIRECT(ADDRESS(ROW(),COLUMN())),0,-1))>21,Q57+7,IF(DAY(OFFSET(INDIRECT(ADDRESS(ROW(),COLUMN())),0,-1))<7,Q57+0,IF(AND(DAY(OFFSET(INDIRECT(ADDRESS(ROW(),COLUMN())),0,-1))>7,DAY(OFFSET(INDIRECT(ADDRESS(ROW(),COLUMN())),0,-1))<15),Q57+7,Q57+0)))","v":"2028-09-19"},null,"2029-06-12",{"$f":"IF(DAY(OFFSET(INDIRECT(ADDRESS(ROW(),COLUMN())),0,-1))<8,T57+7,T57+0)","v":"2029-06-12"},null,"2028-09-18",{"$f":"IF(DAY(OFFSET(INDIRECT(ADDRESS(ROW(),COLUMN())),0,-1))>21,W57+7,IF(DAY(OFFSET(INDIRECT(ADDRESS(ROW(),COLUMN())),0,-1))<7,W57+0,IF(AND(DAY(OFFSET(INDIRECT(ADDRESS(ROW(),COLUMN())),0,-1))>7,DAY(OFFSET(INDIRECT(ADDRESS(ROW(),COLUMN())),0,-1))<15),W57+7,W57+0)))","v":"2028-09-18"},null,"2029-06-14",{"$f":"IF(DAY(OFFSET(INDIRECT(ADDRESS(ROW(),COLUMN())),0,-1))=15,Z57-7,Z57+0)","v":"2029-06-14"},null,null,null,null,null,null,null,null,null,null,null,null,null,null,null,null,"2029-06-12",{"$f":"IF(DAY(OFFSET(INDIRECT(ADDRESS(ROW(),COLUMN())),0,-1))<8,AR57+7,AR57+0)","v":"2029-06-12"},null,"2028-09-18",{"$f":"IF(DAY(OFFSET(INDIRECT(ADDRESS(ROW(),COLUMN())),0,-1))>21,AU57+7,IF(DAY(OFFSET(INDIRECT(ADDRESS(ROW(),COLUMN())),0,-1))<7,AU57+0,IF(AND(DAY(OFFSET(INDIRECT(ADDRESS(ROW(),COLUMN())),0,-1))>7,DAY(OFFSET(INDIRECT(ADDRESS(ROW(),COLUMN())),0,-1))<15),AU57+7,AU57+0)))","v":"2028-09-18"},null,"2029-06-19",{"$f":"IF(DAY(OFFSET(INDIRECT(ADDRESS(ROW(),COLUMN())),0,-1))<16,AX57+7,AX57+0)","v":"2029-06-19"},null,"2028-09-14",{"$f":"IF(DAY(OFFSET(INDIRECT(ADDRESS(ROW(),COLUMN())),0,-1))>21,BA57+7,IF(DAY(OFFSET(INDIRECT(ADDRESS(ROW(),COLUMN())),0,-1))<7,BA57+0,IF(AND(DAY(OFFSET(INDIRECT(ADDRESS(ROW(),COLUMN())),0,-1))>7,DAY(OFFSET(INDIRECT(ADDRESS(ROW(),COLUMN())),0,-1))<15),BA57+7,BA57+0)))","v":"2028-09-21"},null,"2028-09-19",{"$f":"IF(DAY(OFFSET(INDIRECT(ADDRESS(ROW(),COLUMN())),0,-1))>21,BD57+7,IF(DAY(OFFSET(INDIRECT(ADDRESS(ROW(),COLUMN())),0,-1))<7,BD57+0,IF(AND(DAY(OFFSET(INDIRECT(ADDRESS(ROW(),COLUMN())),0,-1))>7,DAY(OFFSET(INDIRECT(ADDRESS(ROW(),COLUMN())),0,-1))<15),BD57+7,BD57+0)))","v":"2028-09-19"},null,"2028-09-19",null,null,"2029-11-22",{"$f":"IF(DAY(OFFSET(INDIRECT(ADDRESS(ROW(),COLUMN())),0,-1))<15,BJ57+7,IF(DAY(OFFSET(INDIRECT(ADDRESS(ROW(),COLUMN())),0,-1))>21,BJ57-7,BJ57+0))","v":"2029-11-15"},null,"2029-06-19",{"$f":"IF(DAY(OFFSET(INDIRECT(ADDRESS(ROW(),COLUMN())),0,-1))<15,BM57+7,IF(DAY(OFFSET(INDIRECT(ADDRESS(ROW(),COLUMN())),0,-1))>21,BM57-7,BM57+0))","v":"2029-06-19"},null,"2029-05-29",{"$f":"IF(DAY(OFFSET(INDIRECT(ADDRESS(ROW(),COLUMN())),0,-1))<21,BP57+7,IF(DAY(OFFSET(INDIRECT(ADDRESS(ROW(),COLUMN())),0,-1))>28,BP57-7,BP57+0))","v":"2029-05-22"},null,null,{"$f":"IF(DAY(BT56)=DAY(21),BT56-6,BT56+1)","v":"2028-01-20"},null,"2029-06-19",{"$f":"IF(DAY(OFFSET(INDIRECT(ADDRESS(ROW(),COLUMN())),0,-1))<15,BV57+7,IF(DAY(OFFSET(INDIRECT(ADDRESS(ROW(),COLUMN())),0,-1))>21,BV57-7,BV57+0))","v":"2029-06-19"},null,"2028-09-19",{"$f":"IF(DAY(OFFSET(INDIRECT(ADDRESS(ROW(),COLUMN())),0,-1))>21,BY57+7,IF(DAY(OFFSET(INDIRECT(ADDRESS(ROW(),COLUMN())),0,-1))<7,BY57+0,IF(AND(DAY(OFFSET(INDIRECT(ADDRESS(ROW(),COLUMN())),0,-1))>7,DAY(OFFSET(INDIRECT(ADDRESS(ROW(),COLUMN())),0,-1))<15),BY57+7,BY57+0)))","v":"2028-09-19"},null,"2027-06-15",null,null,null,null,null,"2029-06-07",{"$f":"IF(DAY(OFFSET(INDIRECT(ADDRESS(ROW(),COLUMN())),0,-1))<7,CH57+0,IF(DAY(OFFSET(INDIRECT(ADDRESS(ROW(),COLUMN())),0,-1))>7,CH57-7,CH57+0))","v":"2029-06-07"},null,"2027-12-02",null,null,"2029-06-12",{"$f":"IF(DAY(OFFSET(INDIRECT(ADDRESS(ROW(),COLUMN())),0,-1))<8,CN57+7,CN57+0)","v":"2029-06-12"},null,"2029-06-04",{"$f":"IF(DAY(OFFSET(INDIRECT(ADDRESS(ROW(),COLUMN())),0,-1))<7,CQ57+0,IF(DAY(OFFSET(INDIRECT(ADDRESS(ROW(),COLUMN())),0,-1))>7,CQ57-7,CQ57+0))","v":"2029-06-04"},null,"2029-06-04",{"$f":"IF(DAY(OFFSET(INDIRECT(ADDRESS(ROW(),COLUMN())),0,-1))<7,CT57+0,IF(DAY(OFFSET(INDIRECT(ADDRESS(ROW(),COLUMN())),0,-1))>7,CT57-7,CT57+0))+3","v":"2029-06-07"},null,"2029-06-04",{"$f":"IF(DAY(OFFSET(INDIRECT(ADDRESS(ROW(),COLUMN())),0,-1))<8,CW57+7,CW57+0)","v":"2029-06-11"},null,"2029-06-18",{"$f":"IF(DAY(OFFSET(INDIRECT(ADDRESS(ROW(),COLUMN())),0,-1))<15,CZ57+7,IF(DAY(OFFSET(INDIRECT(ADDRESS(ROW(),COLUMN())),0,-1))>21,CZ57-7,CZ57+0))","v":"2029-06-18"}]
[null,null,null,null,null,"Div 12","Iredell Water Contact",{"$f":"BL40","v":"2028-08-15"},"Iredell Water Contact",0,7,21,null,"2028-10-02",{"$f":"IF(DAY(OFFSET(INDIRECT(ADDRESS(ROW(),COLUMN())),0,-1))>21,N58+7,IF(DAY(OFFSET(INDIRECT(ADDRESS(ROW(),COLUMN())),0,-1))<7,N58+0,IF(AND(DAY(OFFSET(INDIRECT(ADDRESS(ROW(),COLUMN())),0,-1))>7,DAY(OFFSET(INDIRECT(ADDRESS(ROW(),COLUMN())),0,-1))<15),N58+7,N58+0)))","v":"2028-10-02"},null,"2028-10-03",{"$f":"IF(DAY(OFFSET(INDIRECT(ADDRESS(ROW(),COLUMN())),0,-1))>21,Q58+7,IF(DAY(OFFSET(INDIRECT(ADDRESS(ROW(),COLUMN())),0,-1))<7,Q58+0,IF(AND(DAY(OFFSET(INDIRECT(ADDRESS(ROW(),COLUMN())),0,-1))>7,DAY(OFFSET(INDIRECT(ADDRESS(ROW(),COLUMN())),0,-1))<15),Q58+7,Q58+0)))","v":"2028-10-03"},null,"2029-07-10",{"$f":"IF(DAY(OFFSET(INDIRECT(ADDRESS(ROW(),COLUMN())),0,-1))<8,T58+7,T58+0)","v":"2029-07-10"},null,"2028-10-02",{"$f":"IF(DAY(OFFSET(INDIRECT(ADDRESS(ROW(),COLUMN())),0,-1))>21,W58+7,IF(DAY(OFFSET(INDIRECT(ADDRESS(ROW(),COLUMN())),0,-1))<7,W58+0,IF(AND(DAY(OFFSET(INDIRECT(ADDRESS(ROW(),COLUMN())),0,-1))>7,DAY(OFFSET(INDIRECT(ADDRESS(ROW(),COLUMN())),0,-1))<15),W58+7,W58+0)))","v":"2028-10-02"},null,"2029-07-12",{"$f":"IF(DAY(OFFSET(INDIRECT(ADDRESS(ROW(),COLUMN())),0,-1))=15,Z58-7,Z58+0)","v":"2029-07-12"},null,null,null,null,null,null,null,null,null,null,null,null,null,null,null,null,"2029-07-10",{"$f":"IF(DAY(OFFSET(INDIRECT(ADDRESS(ROW(),COLUMN())),0,-1))<8,AR58+7,AR58+0)","v":"2029-07-10"},null,"2028-10-02",{"$f":"IF(DAY(OFFSET(INDIRECT(ADDRESS(ROW(),COLUMN())),0,-1))>21,AU58+7,IF(DAY(OFFSET(INDIRECT(ADDRESS(ROW(),COLUMN())),0,-1))<7,AU58+0,IF(AND(DAY(OFFSET(INDIRECT(ADDRESS(ROW(),COLUMN())),0,-1))>7,DAY(OFFSET(INDIRECT(ADDRESS(ROW(),COLUMN())),0,-1))<15),AU58+7,AU58+0)))","v":"2028-10-02"},null,"2029-07-17",{"$f":"IF(DAY(OFFSET(INDIRECT(ADDRESS(ROW(),COLUMN())),0,-1))<16,AX58+7,AX58+0)","v":"2029-07-17"},null,"2028-10-05",{"$f":"IF(DAY(OFFSET(INDIRECT(ADDRESS(ROW(),COLUMN())),0,-1))>21,BA58+7,IF(DAY(OFFSET(INDIRECT(ADDRESS(ROW(),COLUMN())),0,-1))<7,BA58+0,IF(AND(DAY(OFFSET(INDIRECT(ADDRESS(ROW(),COLUMN())),0,-1))>7,DAY(OFFSET(INDIRECT(ADDRESS(ROW(),COLUMN())),0,-1))<15),BA58+7,BA58+0)))","v":"2028-10-05"},null,"2028-10-02",{"$f":"IF(DAY(OFFSET(INDIRECT(ADDRESS(ROW(),COLUMN())),0,-1))>21,BD58+7,IF(DAY(OFFSET(INDIRECT(ADDRESS(ROW(),COLUMN())),0,-1))<7,BD58+0,IF(AND(DAY(OFFSET(INDIRECT(ADDRESS(ROW(),COLUMN())),0,-1))>7,DAY(OFFSET(INDIRECT(ADDRESS(ROW(),COLUMN())),0,-1))<15),BD58+7,BD58+0)))","v":"2028-10-02"},null,"2028-10-03",null,null,"2029-12-20",{"$f":"IF(DAY(OFFSET(INDIRECT(ADDRESS(ROW(),COLUMN())),0,-1))<15,BJ58+7,IF(DAY(OFFSET(INDIRECT(ADDRESS(ROW(),COLUMN())),0,-1))>21,BJ58-7,BJ58+0))","v":"2029-12-20"},null,"2029-07-17",{"$f":"IF(DAY(OFFSET(INDIRECT(ADDRESS(ROW(),COLUMN())),0,-1))<15,BM58+7,IF(DAY(OFFSET(INDIRECT(ADDRESS(ROW(),COLUMN())),0,-1))>21,BM58-7,BM58+0))","v":"2029-07-17"},null,"2029-06-26",{"$f":"IF(DAY(OFFSET(INDIRECT(ADDRESS(ROW(),COLUMN())),0,-1))<21,BP58+7,IF(DAY(OFFSET(INDIRECT(ADDRESS(ROW(),COLUMN())),0,-1))>28,BP58-7,BP58+0))","v":"2029-06-26"},null,"2028-01-31",{"$f":"IF(DAY(OFFSET(INDIRECT(ADDRESS(ROW(),COLUMN())),0,-1))>21,BS58+7,IF(DAY(OFFSET(INDIRECT(ADDRESS(ROW(),COLUMN())),0,-1))<7,BS58+0,IF(AND(DAY(OFFSET(INDIRECT(ADDRESS(ROW(),COLUMN())),0,-1))>7,DAY(OFFSET(INDIRECT(ADDRESS(ROW(),COLUMN())),0,-1))<15),BS58+7,BS58+0)))","v":"2028-02-07"},null,"2029-07-17",{"$f":"IF(DAY(OFFSET(INDIRECT(ADDRESS(ROW(),COLUMN())),0,-1))<15,BV58+7,IF(DAY(OFFSET(INDIRECT(ADDRESS(ROW(),COLUMN())),0,-1))>21,BV58-7,BV58+0))","v":"2029-07-17"},null,"2028-10-03",{"$f":"IF(DAY(OFFSET(INDIRECT(ADDRESS(ROW(),COLUMN())),0,-1))>21,BY58+7,IF(DAY(OFFSET(INDIRECT(ADDRESS(ROW(),COLUMN())),0,-1))<7,BY58+0,IF(AND(DAY(OFFSET(INDIRECT(ADDRESS(ROW(),COLUMN())),0,-1))>7,DAY(OFFSET(INDIRECT(ADDRESS(ROW(),COLUMN())),0,-1))<15),BY58+7,BY58+0)))","v":"2028-10-03"},null,"2027-07-06",null,null,null,null,null,"2029-07-05",{"$f":"IF(DAY(OFFSET(INDIRECT(ADDRESS(ROW(),COLUMN())),0,-1))<7,CH58+0,IF(DAY(OFFSET(INDIRECT(ADDRESS(ROW(),COLUMN())),0,-1))>7,CH58-7,CH58+0))","v":"2029-07-05"},null,"2028-01-06",null,null,"2029-07-10",{"$f":"IF(DAY(OFFSET(INDIRECT(ADDRESS(ROW(),COLUMN())),0,-1))<8,CN58+7,CN58+0)","v":"2029-07-10"},null,"2029-07-02",{"$f":"IF(DAY(OFFSET(INDIRECT(ADDRESS(ROW(),COLUMN())),0,-1))<7,CQ58+0,IF(DAY(OFFSET(INDIRECT(ADDRESS(ROW(),COLUMN())),0,-1))>7,CQ58-7,CQ58+0))","v":"2029-07-02"},null,"2029-07-02",{"$f":"IF(DAY(OFFSET(INDIRECT(ADDRESS(ROW(),COLUMN())),0,-1))<7,CT58+0,IF(DAY(OFFSET(INDIRECT(ADDRESS(ROW(),COLUMN())),0,-1))>7,CT58-7,CT58+0))+3","v":"2029-07-05"},null,"2029-07-02",{"$f":"IF(DAY(OFFSET(INDIRECT(ADDRESS(ROW(),COLUMN())),0,-1))<8,CW58+7,CW58+0)","v":"2029-07-09"},null,"2029-07-16",{"$f":"IF(DAY(OFFSET(INDIRECT(ADDRESS(ROW(),COLUMN())),0,-1))<15,CZ58+7,IF(DAY(OFFSET(INDIRECT(ADDRESS(ROW(),COLUMN())),0,-1))>21,CZ58-7,CZ58+0))","v":"2029-07-16"}]
[null,null,null,null,null,"Div 12","City of Belmont",null,"City of Belmont",0,7,0,null,"2028-10-16",{"$f":"IF(DAY(OFFSET(INDIRECT(ADDRESS(ROW(),COLUMN())),0,-1))>21,N59+7,IF(DAY(OFFSET(INDIRECT(ADDRESS(ROW(),COLUMN())),0,-1))<7,N59+0,IF(AND(DAY(OFFSET(INDIRECT(ADDRESS(ROW(),COLUMN())),0,-1))>7,DAY(OFFSET(INDIRECT(ADDRESS(ROW(),COLUMN())),0,-1))<15),N59+7,N59+0)))","v":"2028-10-16"},null,"2028-10-17",{"$f":"IF(DAY(OFFSET(INDIRECT(ADDRESS(ROW(),COLUMN())),0,-1))>21,Q59+7,IF(DAY(OFFSET(INDIRECT(ADDRESS(ROW(),COLUMN())),0,-1))<7,Q59+0,IF(AND(DAY(OFFSET(INDIRECT(ADDRESS(ROW(),COLUMN())),0,-1))>7,DAY(OFFSET(INDIRECT(ADDRESS(ROW(),COLUMN())),0,-1))<15),Q59+7,Q59+0)))","v":"2028-10-17"},null,"2029-08-07",{"$f":"IF(DAY(OFFSET(INDIRECT(ADDRESS(ROW(),COLUMN())),0,-1))<8,T59+7,T59+0)","v":"2029-08-14"},null,"2028-10-16",{"$f":"IF(DAY(OFFSET(INDIRECT(ADDRESS(ROW(),COLUMN())),0,-1))>21,W59+7,IF(DAY(OFFSET(INDIRECT(ADDRESS(ROW(),COLUMN())),0,-1))<7,W59+0,IF(AND(DAY(OFFSET(INDIRECT(ADDRESS(ROW(),COLUMN())),0,-1))>7,DAY(OFFSET(INDIRECT(ADDRESS(ROW(),COLUMN())),0,-1))<15),W59+7,W59+0)))","v":"2028-10-16"},null,"2029-08-09",{"$f":"IF(DAY(OFFSET(INDIRECT(ADDRESS(ROW(),COLUMN())),0,-1))=15,Z59-7,Z59+0)","v":"2029-08-09"},null,null,null,null,null,null,null,null,null,null,null,null,null,null,null,null,"2029-08-07",{"$f":"IF(DAY(OFFSET(INDIRECT(ADDRESS(ROW(),COLUMN())),0,-1))<8,AR59+7,AR59+0)","v":"2029-08-14"},null,"2028-10-16",{"$f":"IF(DAY(OFFSET(INDIRECT(ADDRESS(ROW(),COLUMN())),0,-1))>21,AU59+7,IF(DAY(OFFSET(INDIRECT(ADDRESS(ROW(),COLUMN())),0,-1))<7,AU59+0,IF(AND(DAY(OFFSET(INDIRECT(ADDRESS(ROW(),COLUMN())),0,-1))>7,DAY(OFFSET(INDIRECT(ADDRESS(ROW(),COLUMN())),0,-1))<15),AU59+7,AU59+0)))","v":"2028-10-16"},null,"2029-08-21",{"$f":"IF(DAY(OFFSET(INDIRECT(ADDRESS(ROW(),COLUMN())),0,-1))<16,AX59+7,AX59+0)","v":"2029-08-21"},null,"2028-10-19",{"$f":"IF(DAY(OFFSET(INDIRECT(ADDRESS(ROW(),COLUMN())),0,-1))>21,BA59+7,IF(DAY(OFFSET(INDIRECT(ADDRESS(ROW(),COLUMN())),0,-1))<7,BA59+0,IF(AND(DAY(OFFSET(INDIRECT(ADDRESS(ROW(),COLUMN())),0,-1))>7,DAY(OFFSET(INDIRECT(ADDRESS(ROW(),COLUMN())),0,-1))<15),BA59+7,BA59+0)))","v":"2028-10-19"},null,"2028-10-17",{"$f":"IF(DAY(OFFSET(INDIRECT(ADDRESS(ROW(),COLUMN())),0,-1))>21,BD59+7,IF(DAY(OFFSET(INDIRECT(ADDRESS(ROW(),COLUMN())),0,-1))<7,BD59+0,IF(AND(DAY(OFFSET(INDIRECT(ADDRESS(ROW(),COLUMN())),0,-1))>7,DAY(OFFSET(INDIRECT(ADDRESS(ROW(),COLUMN())),0,-1))<15),BD59+7,BD59+0)))","v":"2028-10-17"},null,"2028-10-17",null,null,"2030-01-17",{"$f":"IF(DAY(OFFSET(INDIRECT(ADDRESS(ROW(),COLUMN())),0,-1))<15,BJ59+7,IF(DAY(OFFSET(INDIRECT(ADDRESS(ROW(),COLUMN())),0,-1))>21,BJ59-7,BJ59+0))","v":"2030-01-17"},null,"2029-08-21",{"$f":"IF(DAY(OFFSET(INDIRECT(ADDRESS(ROW(),COLUMN())),0,-1))<15,BM59+7,IF(DAY(OFFSET(INDIRECT(ADDRESS(ROW(),COLUMN())),0,-1))>21,BM59-7,BM59+0))","v":"2029-08-21"},null,"2029-07-24",{"$f":"IF(DAY(OFFSET(INDIRECT(ADDRESS(ROW(),COLUMN())),0,-1))<21,BP59+7,IF(DAY(OFFSET(INDIRECT(ADDRESS(ROW(),COLUMN())),0,-1))>28,BP59-7,BP59+0))","v":"2029-07-24"},null,"2028-02-14",{"$f":"IF((DAY(BS59))<DAY(13),BS59+10,IF((DAY(BS59))>=DAY(20),BS59-5,BS59+2))","v":"2028-02-16"},null,"2029-08-21",{"$f":"IF(DAY(OFFSET(INDIRECT(ADDRESS(ROW(),COLUMN())),0,-1))<15,BV59+7,IF(DAY(OFFSET(INDIRECT(ADDRESS(ROW(),COLUMN())),0,-1))>21,BV59-7,BV59+0))","v":"2029-08-21"},null,"2028-10-17",{"$f":"IF(DAY(OFFSET(INDIRECT(ADDRESS(ROW(),COLUMN())),0,-1))>21,BY59+7,IF(DAY(OFFSET(INDIRECT(ADDRESS(ROW(),COLUMN())),0,-1))<7,BY59+0,IF(AND(DAY(OFFSET(INDIRECT(ADDRESS(ROW(),COLUMN())),0,-1))>7,DAY(OFFSET(INDIRECT(ADDRESS(ROW(),COLUMN())),0,-1))<15),BY59+7,BY59+0)))","v":"2028-10-17"},null,"2027-07-20",null,null,null,null,null,"2029-08-02",{"$f":"IF(DAY(OFFSET(INDIRECT(ADDRESS(ROW(),COLUMN())),0,-1))<7,CH59+0,IF(DAY(OFFSET(INDIRECT(ADDRESS(ROW(),COLUMN())),0,-1))>7,CH59-7,CH59+0))","v":"2029-08-02"},null,"2028-02-03",null,null,"2029-08-07",{"$f":"IF(DAY(OFFSET(INDIRECT(ADDRESS(ROW(),COLUMN())),0,-1))<8,CN59+7,CN59+0)","v":"2029-08-14"},null,"2029-08-06",{"$f":"IF(DAY(OFFSET(INDIRECT(ADDRESS(ROW(),COLUMN())),0,-1))<7,CQ59+0,IF(DAY(OFFSET(INDIRECT(ADDRESS(ROW(),COLUMN())),0,-1))>7,CQ59-7,CQ59+0))","v":"2029-08-06"},null,"2029-08-06",{"$f":"IF(DAY(OFFSET(INDIRECT(ADDRESS(ROW(),COLUMN())),0,-1))<7,CT59+0,IF(DAY(OFFSET(INDIRECT(ADDRESS(ROW(),COLUMN())),0,-1))>7,CT59-7,CT59+0))+3","v":"2029-08-09"},null,"2029-08-06",{"$f":"IF(DAY(OFFSET(INDIRECT(ADDRESS(ROW(),COLUMN())),0,-1))<8,CW59+7,CW59+0)","v":"2029-08-13"},null,"2029-08-20",{"$f":"IF(DAY(OFFSET(INDIRECT(ADDRESS(ROW(),COLUMN())),0,-1))<15,CZ59+7,IF(DAY(OFFSET(INDIRECT(ADDRESS(ROW(),COLUMN())),0,-1))>21,CZ59-7,CZ59+0))","v":"2029-08-20"}]
[null,null,null,null,null,"Div 12","Town of Mooresville",{"$f":"M40","v":"2028-08-21"},"Town of Mooresville",0,7,60,null,"2028-10-30",{"$f":"IF(DAY(OFFSET(INDIRECT(ADDRESS(ROW(),COLUMN())),0,-1))>21,N60+7,IF(DAY(OFFSET(INDIRECT(ADDRESS(ROW(),COLUMN())),0,-1))<7,N60+0,IF(AND(DAY(OFFSET(INDIRECT(ADDRESS(ROW(),COLUMN())),0,-1))>7,DAY(OFFSET(INDIRECT(ADDRESS(ROW(),COLUMN())),0,-1))<15),N60+7,N60+0)))","v":"2028-11-06"},null,"2028-11-07",{"$f":"IF(DAY(OFFSET(INDIRECT(ADDRESS(ROW(),COLUMN())),0,-1))>21,Q60+7,IF(DAY(OFFSET(INDIRECT(ADDRESS(ROW(),COLUMN())),0,-1))<7,Q60+0,IF(AND(DAY(OFFSET(INDIRECT(ADDRESS(ROW(),COLUMN())),0,-1))>7,DAY(OFFSET(INDIRECT(ADDRESS(ROW(),COLUMN())),0,-1))<15),Q60+7,Q60+0)))","v":"2028-11-07"},null,"2029-09-11",{"$f":"IF(DAY(OFFSET(INDIRECT(ADDRESS(ROW(),COLUMN())),0,-1))<8,T60+7,T60+0)","v":"2029-09-11"},null,"2028-10-30",{"$f":"IF(DAY(OFFSET(INDIRECT(ADDRESS(ROW(),COLUMN())),0,-1))>21,W60+7,IF(DAY(OFFSET(INDIRECT(ADDRESS(ROW(),COLUMN())),0,-1))<7,W60+0,IF(AND(DAY(OFFSET(INDIRECT(ADDRESS(ROW(),COLUMN())),0,-1))>7,DAY(OFFSET(INDIRECT(ADDRESS(ROW(),COLUMN())),0,-1))<15),W60+7,W60+0)))","v":"2028-11-06"},null,"2029-09-13",{"$f":"IF(DAY(OFFSET(INDIRECT(ADDRESS(ROW(),COLUMN())),0,-1))=15,Z60-7,Z60+0)","v":"2029-09-13"},null,null,null,null,null,null,null,null,null,null,null,null,null,null,null,null,"2029-09-11",{"$f":"IF(DAY(OFFSET(INDIRECT(ADDRESS(ROW(),COLUMN())),0,-1))<8,AR60+7,AR60+0)","v":"2029-09-11"},null,"2028-10-30",{"$f":"IF(DAY(OFFSET(INDIRECT(ADDRESS(ROW(),COLUMN())),0,-1))>21,AU60+7,IF(DAY(OFFSET(INDIRECT(ADDRESS(ROW(),COLUMN())),0,-1))<7,AU60+0,IF(AND(DAY(OFFSET(INDIRECT(ADDRESS(ROW(),COLUMN())),0,-1))>7,DAY(OFFSET(INDIRECT(ADDRESS(ROW(),COLUMN())),0,-1))<15),AU60+7,AU60+0)))","v":"2028-11-06"},null,"2029-09-18",{"$f":"IF(DAY(OFFSET(INDIRECT(ADDRESS(ROW(),COLUMN())),0,-1))<16,AX60+7,AX60+0)","v":"2029-09-18"},null,"2028-11-02",{"$f":"IF(DAY(OFFSET(INDIRECT(ADDRESS(ROW(),COLUMN())),0,-1))>21,BA60+7,IF(DAY(OFFSET(INDIRECT(ADDRESS(ROW(),COLUMN())),0,-1))<7,BA60+0,IF(AND(DAY(OFFSET(INDIRECT(ADDRESS(ROW(),COLUMN())),0,-1))>7,DAY(OFFSET(INDIRECT(ADDRESS(ROW(),COLUMN())),0,-1))<15),BA60+7,BA60+0)))","v":"2028-11-02"},null,"2028-10-30",{"$f":"IF(DAY(OFFSET(INDIRECT(ADDRESS(ROW(),COLUMN())),0,-1))>21,BD60+7,IF(DAY(OFFSET(INDIRECT(ADDRESS(ROW(),COLUMN())),0,-1))<7,BD60+0,IF(AND(DAY(OFFSET(INDIRECT(ADDRESS(ROW(),COLUMN())),0,-1))>7,DAY(OFFSET(INDIRECT(ADDRESS(ROW(),COLUMN())),0,-1))<15),BD60+7,BD60+0)))","v":"2028-11-06"},null,"2028-10-31",null,null,"2030-02-21",{"$f":"IF(DAY(OFFSET(INDIRECT(ADDRESS(ROW(),COLUMN())),0,-1))<15,BJ60+7,IF(DAY(OFFSET(INDIRECT(ADDRESS(ROW(),COLUMN())),0,-1))>21,BJ60-7,BJ60+0))","v":"2030-02-21"},null,"2029-09-18",{"$f":"IF(DAY(OFFSET(INDIRECT(ADDRESS(ROW(),COLUMN())),0,-1))<15,BM60+7,IF(DAY(OFFSET(INDIRECT(ADDRESS(ROW(),COLUMN())),0,-1))>21,BM60-7,BM60+0))","v":"2029-09-18"},null,"2029-08-28",{"$f":"IF(DAY(OFFSET(INDIRECT(ADDRESS(ROW(),COLUMN())),0,-1))<21,BP60+7,IF(DAY(OFFSET(INDIRECT(ADDRESS(ROW(),COLUMN())),0,-1))>28,BP60-7,BP60+0))","v":"2029-08-28"},null,null,{"$f":"IF(DAY(BT59)=DAY(21),BT59-6,BT59+1)","v":"2028-02-17"},null,"2029-09-18",{"$f":"IF(DAY(OFFSET(INDIRECT(ADDRESS(ROW(),COLUMN())),0,-1))<15,BV60+7,IF(DAY(OFFSET(INDIRECT(ADDRESS(ROW(),COLUMN())),0,-1))>21,BV60-7,BV60+0))","v":"2029-09-18"},null,"2028-11-07",{"$f":"IF(DAY(OFFSET(INDIRECT(ADDRESS(ROW(),COLUMN())),0,-1))>21,BY60+7,IF(DAY(OFFSET(INDIRECT(ADDRESS(ROW(),COLUMN())),0,-1))<7,BY60+0,IF(AND(DAY(OFFSET(INDIRECT(ADDRESS(ROW(),COLUMN())),0,-1))>7,DAY(OFFSET(INDIRECT(ADDRESS(ROW(),COLUMN())),0,-1))<15),BY60+7,BY60+0)))","v":"2028-11-07"},null,"2027-08-03",null,null,null,null,null,"2029-09-06",{"$f":"IF(DAY(OFFSET(INDIRECT(ADDRESS(ROW(),COLUMN())),0,-1))<7,CH60+0,IF(DAY(OFFSET(INDIRECT(ADDRESS(ROW(),COLUMN())),0,-1))>7,CH60-7,CH60+0))","v":"2029-09-06"},null,"2028-03-02",null,null,"2029-09-11",{"$f":"IF(DAY(OFFSET(INDIRECT(ADDRESS(ROW(),COLUMN())),0,-1))<8,CN60+7,CN60+0)","v":"2029-09-11"},null,"2029-09-03",{"$f":"IF(DAY(OFFSET(INDIRECT(ADDRESS(ROW(),COLUMN())),0,-1))<7,CQ60+0,IF(DAY(OFFSET(INDIRECT(ADDRESS(ROW(),COLUMN())),0,-1))>7,CQ60-7,CQ60+0))","v":"2029-09-03"},null,"2029-09-03",{"$f":"IF(DAY(OFFSET(INDIRECT(ADDRESS(ROW(),COLUMN())),0,-1))<7,CT60+0,IF(DAY(OFFSET(INDIRECT(ADDRESS(ROW(),COLUMN())),0,-1))>7,CT60-7,CT60+0))+3","v":"2029-09-06"},null,"2029-09-03",{"$f":"IF(DAY(OFFSET(INDIRECT(ADDRESS(ROW(),COLUMN())),0,-1))<8,CW60+7,CW60+0)","v":"2029-09-10"},null,"2029-09-17",{"$f":"IF(DAY(OFFSET(INDIRECT(ADDRESS(ROW(),COLUMN())),0,-1))<15,CZ60+7,IF(DAY(OFFSET(INDIRECT(ADDRESS(ROW(),COLUMN())),0,-1))>21,CZ60-7,CZ60+0))","v":"2029-09-17"}]
[null,null,null,null,null,"Div 12","Aqua NC",null,"Aqua NC",null,null,null,null,"2028-11-13",{"$f":"IF(DAY(OFFSET(INDIRECT(ADDRESS(ROW(),COLUMN())),0,-1))>21,N61+7,IF(DAY(OFFSET(INDIRECT(ADDRESS(ROW(),COLUMN())),0,-1))<7,N61+0,IF(AND(DAY(OFFSET(INDIRECT(ADDRESS(ROW(),COLUMN())),0,-1))>7,DAY(OFFSET(INDIRECT(ADDRESS(ROW(),COLUMN())),0,-1))<15),N61+7,N61+0)))","v":"2028-11-20"},null,"2028-11-21",{"$f":"IF(DAY(OFFSET(INDIRECT(ADDRESS(ROW(),COLUMN())),0,-1))>21,Q61+7,IF(DAY(OFFSET(INDIRECT(ADDRESS(ROW(),COLUMN())),0,-1))<7,Q61+0,IF(AND(DAY(OFFSET(INDIRECT(ADDRESS(ROW(),COLUMN())),0,-1))>7,DAY(OFFSET(INDIRECT(ADDRESS(ROW(),COLUMN())),0,-1))<15),Q61+7,Q61+0)))","v":"2028-11-21"},null,"2029-10-09",{"$f":"IF(DAY(OFFSET(INDIRECT(ADDRESS(ROW(),COLUMN())),0,-1))<8,T61+7,T61+0)","v":"2029-10-09"},null,"2028-11-13",{"$f":"IF(DAY(OFFSET(INDIRECT(ADDRESS(ROW(),COLUMN())),0,-1))>21,W61+7,IF(DAY(OFFSET(INDIRECT(ADDRESS(ROW(),COLUMN())),0,-1))<7,W61+0,IF(AND(DAY(OFFSET(INDIRECT(ADDRESS(ROW(),COLUMN())),0,-1))>7,DAY(OFFSET(INDIRECT(ADDRESS(ROW(),COLUMN())),0,-1))<15),W61+7,W61+0)))","v":"2028-11-20"},null,"2029-10-11",{"$f":"IF(DAY(OFFSET(INDIRECT(ADDRESS(ROW(),COLUMN())),0,-1))=15,Z61-7,Z61+0)","v":"2029-10-11"},null,null,null,null,null,null,null,null,null,null,null,null,null,null,null,null,"2029-10-09",{"$f":"IF(DAY(OFFSET(INDIRECT(ADDRESS(ROW(),COLUMN())),0,-1))<8,AR61+7,AR61+0)","v":"2029-10-09"},null,"2028-11-13",{"$f":"IF(DAY(OFFSET(INDIRECT(ADDRESS(ROW(),COLUMN())),0,-1))>21,AU61+7,IF(DAY(OFFSET(INDIRECT(ADDRESS(ROW(),COLUMN())),0,-1))<7,AU61+0,IF(AND(DAY(OFFSET(INDIRECT(ADDRESS(ROW(),COLUMN())),0,-1))>7,DAY(OFFSET(INDIRECT(ADDRESS(ROW(),COLUMN())),0,-1))<15),AU61+7,AU61+0)))","v":"2028-11-20"},null,"2029-10-16",{"$f":"IF(DAY(OFFSET(INDIRECT(ADDRESS(ROW(),COLUMN())),0,-1))<16,AX61+7,AX61+0)","v":"2029-10-16"},null,"2028-11-16",{"$f":"IF(DAY(OFFSET(INDIRECT(ADDRESS(ROW(),COLUMN())),0,-1))>21,BA61+7,IF(DAY(OFFSET(INDIRECT(ADDRESS(ROW(),COLUMN())),0,-1))<7,BA61+0,IF(AND(DAY(OFFSET(INDIRECT(ADDRESS(ROW(),COLUMN())),0,-1))>7,DAY(OFFSET(INDIRECT(ADDRESS(ROW(),COLUMN())),0,-1))<15),BA61+7,BA61+0)))","v":"2028-11-16"},null,"2028-11-21",{"$f":"IF(DAY(OFFSET(INDIRECT(ADDRESS(ROW(),COLUMN())),0,-1))>21,BD61+7,IF(DAY(OFFSET(INDIRECT(ADDRESS(ROW(),COLUMN())),0,-1))<7,BD61+0,IF(AND(DAY(OFFSET(INDIRECT(ADDRESS(ROW(),COLUMN())),0,-1))>7,DAY(OFFSET(INDIRECT(ADDRESS(ROW(),COLUMN())),0,-1))<15),BD61+7,BD61+0)))","v":"2028-11-21"},null,"2028-11-14",null,null,"2030-03-21",{"$f":"IF(DAY(OFFSET(INDIRECT(ADDRESS(ROW(),COLUMN())),0,-1))<15,BJ61+7,IF(DAY(OFFSET(INDIRECT(ADDRESS(ROW(),COLUMN())),0,-1))>21,BJ61-7,BJ61+0))","v":"2030-03-21"},null,"2029-10-16",{"$f":"IF(DAY(OFFSET(INDIRECT(ADDRESS(ROW(),COLUMN())),0,-1))<15,BM61+7,IF(DAY(OFFSET(INDIRECT(ADDRESS(ROW(),COLUMN())),0,-1))>21,BM61-7,BM61+0))","v":"2029-10-16"},null,"2029-09-25",{"$f":"IF(DAY(OFFSET(INDIRECT(ADDRESS(ROW(),COLUMN())),0,-1))<21,BP61+7,IF(DAY(OFFSET(INDIRECT(ADDRESS(ROW(),COLUMN())),0,-1))>28,BP61-7,BP61+0))","v":"2029-09-25"},null,"2028-02-28",{"$f":"IF(DAY(OFFSET(INDIRECT(ADDRESS(ROW(),COLUMN())),0,-1))>21,BS61+7,IF(DAY(OFFSET(INDIRECT(ADDRESS(ROW(),COLUMN())),0,-1))<7,BS61+0,IF(AND(DAY(OFFSET(INDIRECT(ADDRESS(ROW(),COLUMN())),0,-1))>7,DAY(OFFSET(INDIRECT(ADDRESS(ROW(),COLUMN())),0,-1))<15),BS61+7,BS61+0)))","v":"2028-03-06"},null,"2029-10-16",{"$f":"IF(DAY(OFFSET(INDIRECT(ADDRESS(ROW(),COLUMN())),0,-1))<15,BV61+7,IF(DAY(OFFSET(INDIRECT(ADDRESS(ROW(),COLUMN())),0,-1))>21,BV61-7,BV61+0))","v":"2029-10-16"},null,"2028-11-21",{"$f":"IF(DAY(OFFSET(INDIRECT(ADDRESS(ROW(),COLUMN())),0,-1))>21,BY61+7,IF(DAY(OFFSET(INDIRECT(ADDRESS(ROW(),COLUMN())),0,-1))<7,BY61+0,IF(AND(DAY(OFFSET(INDIRECT(ADDRESS(ROW(),COLUMN())),0,-1))>7,DAY(OFFSET(INDIRECT(ADDRESS(ROW(),COLUMN())),0,-1))<15),BY61+7,BY61+0)))","v":"2028-11-21"},null,"2027-08-17",null,null,null,null,null,"2029-10-04",{"$f":"IF(DAY(OFFSET(INDIRECT(ADDRESS(ROW(),COLUMN())),0,-1))<7,CH61+0,IF(DAY(OFFSET(INDIRECT(ADDRESS(ROW(),COLUMN())),0,-1))>7,CH61-7,CH61+0))","v":"2029-10-04"},null,"2028-04-06",null,null,"2029-10-09",{"$f":"IF(DAY(OFFSET(INDIRECT(ADDRESS(ROW(),COLUMN())),0,-1))<8,CN61+7,CN61+0)","v":"2029-10-09"},null,"2029-10-08",{"$f":"IF(DAY(OFFSET(INDIRECT(ADDRESS(ROW(),COLUMN())),0,-1))<7,CQ61+0,IF(DAY(OFFSET(INDIRECT(ADDRESS(ROW(),COLUMN())),0,-1))>7,CQ61-7,CQ61+0))","v":"2029-10-01"},null,"2029-10-08",{"$f":"IF(DAY(OFFSET(INDIRECT(ADDRESS(ROW(),COLUMN())),0,-1))<7,CT61+0,IF(DAY(OFFSET(INDIRECT(ADDRESS(ROW(),COLUMN())),0,-1))>7,CT61-7,CT61+0))+3","v":"2029-10-04"},null,"2029-10-08",{"$f":"IF(DAY(OFFSET(INDIRECT(ADDRESS(ROW(),COLUMN())),0,-1))<8,CW61+7,CW61+0)","v":"2029-10-08"},null,"2029-10-22",{"$f":"IF(DAY(OFFSET(INDIRECT(ADDRESS(ROW(),COLUMN())),0,-1))<15,CZ61+7,IF(DAY(OFFSET(INDIRECT(ADDRESS(ROW(),COLUMN())),0,-1))>21,CZ61-7,CZ61+0))","v":"2029-10-15"}]
[null,null,null,null,null,"Div 12","City of Hickory",{"$f":"P40","v":"2028-08-15"},"City of Hickory",0,5,7,null,"2028-12-04",{"$f":"IF(DAY(OFFSET(INDIRECT(ADDRESS(ROW(),COLUMN())),0,-1))>21,N62+7,IF(DAY(OFFSET(INDIRECT(ADDRESS(ROW(),COLUMN())),0,-1))<7,N62+0,IF(AND(DAY(OFFSET(INDIRECT(ADDRESS(ROW(),COLUMN())),0,-1))>7,DAY(OFFSET(INDIRECT(ADDRESS(ROW(),COLUMN())),0,-1))<15),N62+7,N62+0)))","v":"2028-12-04"},null,"2028-12-05",{"$f":"IF(DAY(OFFSET(INDIRECT(ADDRESS(ROW(),COLUMN())),0,-1))>21,Q62+7,IF(DAY(OFFSET(INDIRECT(ADDRESS(ROW(),COLUMN())),0,-1))<7,Q62+0,IF(AND(DAY(OFFSET(INDIRECT(ADDRESS(ROW(),COLUMN())),0,-1))>7,DAY(OFFSET(INDIRECT(ADDRESS(ROW(),COLUMN())),0,-1))<15),Q62+7,Q62+0)))","v":"2028-12-05"},null,"2029-11-06",{"$f":"IF(DAY(OFFSET(INDIRECT(ADDRESS(ROW(),COLUMN())),0,-1))<8,T62+7,T62+0)","v":"2029-11-13"},null,"2028-12-04",{"$f":"IF(DAY(OFFSET(INDIRECT(ADDRESS(ROW(),COLUMN())),0,-1))>21,W62+7,IF(DAY(OFFSET(INDIRECT(ADDRESS(ROW(),COLUMN())),0,-1))<7,W62+0,IF(AND(DAY(OFFSET(INDIRECT(ADDRESS(ROW(),COLUMN())),0,-1))>7,DAY(OFFSET(INDIRECT(ADDRESS(ROW(),COLUMN())),0,-1))<15),W62+7,W62+0)))","v":"2028-12-04"},null,"2029-11-15",{"$f":"IF(DAY(OFFSET(INDIRECT(ADDRESS(ROW(),COLUMN())),0,-1))=15,Z62-7,Z62+0)","v":"2029-11-08"},null,null,null,null,null,null,null,null,null,null,null,null,null,null,null,null,"2029-11-06",{"$f":"IF(DAY(OFFSET(INDIRECT(ADDRESS(ROW(),COLUMN())),0,-1))<8,AR62+7,AR62+0)","v":"2029-11-13"},null,"2028-12-04",{"$f":"IF(DAY(OFFSET(INDIRECT(ADDRESS(ROW(),COLUMN())),0,-1))>21,AU62+7,IF(DAY(OFFSET(INDIRECT(ADDRESS(ROW(),COLUMN())),0,-1))<7,AU62+0,IF(AND(DAY(OFFSET(INDIRECT(ADDRESS(ROW(),COLUMN())),0,-1))>7,DAY(OFFSET(INDIRECT(ADDRESS(ROW(),COLUMN())),0,-1))<15),AU62+7,AU62+0)))","v":"2028-12-04"},null,"2029-11-20",{"$f":"IF(DAY(OFFSET(INDIRECT(ADDRESS(ROW(),COLUMN())),0,-1))<16,AX62+7,AX62+0)","v":"2029-11-20"},null,"2028-11-30",{"$f":"IF(DAY(OFFSET(INDIRECT(ADDRESS(ROW(),COLUMN())),0,-1))>21,BA62+7,IF(DAY(OFFSET(INDIRECT(ADDRESS(ROW(),COLUMN())),0,-1))<7,BA62+0,IF(AND(DAY(OFFSET(INDIRECT(ADDRESS(ROW(),COLUMN())),0,-1))>7,DAY(OFFSET(INDIRECT(ADDRESS(ROW(),COLUMN())),0,-1))<15),BA62+7,BA62+0)))","v":"2028-12-07"},null,"2028-12-04",{"$f":"IF(DAY(OFFSET(INDIRECT(ADDRESS(ROW(),COLUMN())),0,-1))>21,BD62+7,IF(DAY(OFFSET(INDIRECT(ADDRESS(ROW(),COLUMN())),0,-1))<7,BD62+0,IF(AND(DAY(OFFSET(INDIRECT(ADDRESS(ROW(),COLUMN())),0,-1))>7,DAY(OFFSET(INDIRECT(ADDRESS(ROW(),COLUMN())),0,-1))<15),BD62+7,BD62+0)))","v":"2028-12-04"},null,"2028-12-05",null,null,"2030-04-18",{"$f":"IF(DAY(OFFSET(INDIRECT(ADDRESS(ROW(),COLUMN())),0,-1))<15,BJ62+7,IF(DAY(OFFSET(INDIRECT(ADDRESS(ROW(),COLUMN())),0,-1))>21,BJ62-7,BJ62+0))","v":"2030-04-18"},null,"2029-11-20",{"$f":"IF(DAY(OFFSET(INDIRECT(ADDRESS(ROW(),COLUMN())),0,-1))<15,BM62+7,IF(DAY(OFFSET(INDIRECT(ADDRESS(ROW(),COLUMN())),0,-1))>21,BM62-7,BM62+0))","v":"2029-11-20"},null,"2029-10-23",{"$f":"IF(DAY(OFFSET(INDIRECT(ADDRESS(ROW(),COLUMN())),0,-1))<21,BP62+7,IF(DAY(OFFSET(INDIRECT(ADDRESS(ROW(),COLUMN())),0,-1))>28,BP62-7,BP62+0))","v":"2029-10-23"},null,"2028-03-20",{"$f":"IF((DAY(BS62))<DAY(13),BS62+10,IF((DAY(BS62))>=DAY(20),BS62-5,BS62+2))","v":"2028-03-15"},null,"2029-11-20",{"$f":"IF(DAY(OFFSET(INDIRECT(ADDRESS(ROW(),COLUMN())),0,-1))<15,BV62+7,IF(DAY(OFFSET(INDIRECT(ADDRESS(ROW(),COLUMN())),0,-1))>21,BV62-7,BV62+0))","v":"2029-11-20"},null,"2028-12-05",{"$f":"IF(DAY(OFFSET(INDIRECT(ADDRESS(ROW(),COLUMN())),0,-1))>21,BY62+7,IF(DAY(OFFSET(INDIRECT(ADDRESS(ROW(),COLUMN())),0,-1))<7,BY62+0,IF(AND(DAY(OFFSET(INDIRECT(ADDRESS(ROW(),COLUMN())),0,-1))>7,DAY(OFFSET(INDIRECT(ADDRESS(ROW(),COLUMN())),0,-1))<15),BY62+7,BY62+0)))","v":"2028-12-05"},null,"2027-09-07",null,null,null,null,null,"2029-11-08",{"$f":"IF(DAY(OFFSET(INDIRECT(ADDRESS(ROW(),COLUMN())),0,-1))<7,CH62+0,IF(DAY(OFFSET(INDIRECT(ADDRESS(ROW(),COLUMN())),0,-1))>7,CH62-7,CH62+0))","v":"2029-11-01"},null,"2028-05-04",null,null,"2029-11-06",{"$f":"IF(DAY(OFFSET(INDIRECT(ADDRESS(ROW(),COLUMN())),0,-1))<8,CN62+7,CN62+0)","v":"2029-11-13"},null,"2029-11-05",{"$f":"IF(DAY(OFFSET(INDIRECT(ADDRESS(ROW(),COLUMN())),0,-1))<7,CQ62+0,IF(DAY(OFFSET(INDIRECT(ADDRESS(ROW(),COLUMN())),0,-1))>7,CQ62-7,CQ62+0))","v":"2029-11-05"},null,"2029-11-05",{"$f":"IF(DAY(OFFSET(INDIRECT(ADDRESS(ROW(),COLUMN())),0,-1))<7,CT62+0,IF(DAY(OFFSET(INDIRECT(ADDRESS(ROW(),COLUMN())),0,-1))>7,CT62-7,CT62+0))+3","v":"2029-11-08"},null,"2029-11-05",{"$f":"IF(DAY(OFFSET(INDIRECT(ADDRESS(ROW(),COLUMN())),0,-1))<8,CW62+7,CW62+0)","v":"2029-11-12"},null,"2029-11-19",{"$f":"IF(DAY(OFFSET(INDIRECT(ADDRESS(ROW(),COLUMN())),0,-1))<15,CZ62+7,IF(DAY(OFFSET(INDIRECT(ADDRESS(ROW(),COLUMN())),0,-1))>21,CZ62-7,CZ62+0))","v":"2029-11-19"}]
[null,null,null,null,null,"Div 12","Utilities Inc.",null,"Utilities Inc.",null,null,null,null,"2028-12-18",{"$f":"IF(DAY(OFFSET(INDIRECT(ADDRESS(ROW(),COLUMN())),0,-1))>21,N63+7,IF(DAY(OFFSET(INDIRECT(ADDRESS(ROW(),COLUMN())),0,-1))<7,N63+0,IF(AND(DAY(OFFSET(INDIRECT(ADDRESS(ROW(),COLUMN())),0,-1))>7,DAY(OFFSET(INDIRECT(ADDRESS(ROW(),COLUMN())),0,-1))<15),N63+7,N63+0)))","v":"2028-12-18"},null,"2028-12-19",{"$f":"IF(DAY(OFFSET(INDIRECT(ADDRESS(ROW(),COLUMN())),0,-1))>21,Q63+7,IF(DAY(OFFSET(INDIRECT(ADDRESS(ROW(),COLUMN())),0,-1))<7,Q63+0,IF(AND(DAY(OFFSET(INDIRECT(ADDRESS(ROW(),COLUMN())),0,-1))>7,DAY(OFFSET(INDIRECT(ADDRESS(ROW(),COLUMN())),0,-1))<15),Q63+7,Q63+0)))","v":"2028-12-19"},null,"2029-12-11",{"$f":"IF(DAY(OFFSET(INDIRECT(ADDRESS(ROW(),COLUMN())),0,-1))<8,T63+7,T63+0)","v":"2029-12-11"},null,"2028-12-18",{"$f":"IF(DAY(OFFSET(INDIRECT(ADDRESS(ROW(),COLUMN())),0,-1))>21,W63+7,IF(DAY(OFFSET(INDIRECT(ADDRESS(ROW(),COLUMN())),0,-1))<7,W63+0,IF(AND(DAY(OFFSET(INDIRECT(ADDRESS(ROW(),COLUMN())),0,-1))>7,DAY(OFFSET(INDIRECT(ADDRESS(ROW(),COLUMN())),0,-1))<15),W63+7,W63+0)))","v":"2028-12-18"},null,"2029-12-13",{"$f":"IF(DAY(OFFSET(INDIRECT(ADDRESS(ROW(),COLUMN())),0,-1))=15,Z63-7,Z63+0)","v":"2029-12-13"},null,null,null,null,null,null,null,null,null,null,null,null,null,null,null,null,"2029-12-11",{"$f":"IF(DAY(OFFSET(INDIRECT(ADDRESS(ROW(),COLUMN())),0,-1))<8,AR63+7,AR63+0)","v":"2029-12-11"},null,"2028-12-18",{"$f":"IF(DAY(OFFSET(INDIRECT(ADDRESS(ROW(),COLUMN())),0,-1))>21,AU63+7,IF(DAY(OFFSET(INDIRECT(ADDRESS(ROW(),COLUMN())),0,-1))<7,AU63+0,IF(AND(DAY(OFFSET(INDIRECT(ADDRESS(ROW(),COLUMN())),0,-1))>7,DAY(OFFSET(INDIRECT(ADDRESS(ROW(),COLUMN())),0,-1))<15),AU63+7,AU63+0)))","v":"2028-12-18"},null,"2029-12-18",{"$f":"IF(DAY(OFFSET(INDIRECT(ADDRESS(ROW(),COLUMN())),0,-1))<16,AX63+7,AX63+0)","v":"2029-12-18"},null,"2028-12-14",{"$f":"IF(DAY(OFFSET(INDIRECT(ADDRESS(ROW(),COLUMN())),0,-1))>21,BA63+7,IF(DAY(OFFSET(INDIRECT(ADDRESS(ROW(),COLUMN())),0,-1))<7,BA63+0,IF(AND(DAY(OFFSET(INDIRECT(ADDRESS(ROW(),COLUMN())),0,-1))>7,DAY(OFFSET(INDIRECT(ADDRESS(ROW(),COLUMN())),0,-1))<15),BA63+7,BA63+0)))","v":"2028-12-21"},null,"2028-12-19",{"$f":"IF(DAY(OFFSET(INDIRECT(ADDRESS(ROW(),COLUMN())),0,-1))>21,BD63+7,IF(DAY(OFFSET(INDIRECT(ADDRESS(ROW(),COLUMN())),0,-1))<7,BD63+0,IF(AND(DAY(OFFSET(INDIRECT(ADDRESS(ROW(),COLUMN())),0,-1))>7,DAY(OFFSET(INDIRECT(ADDRESS(ROW(),COLUMN())),0,-1))<15),BD63+7,BD63+0)))","v":"2028-12-19"},null,"2028-12-19",null,null,"2030-05-16",{"$f":"IF(DAY(OFFSET(INDIRECT(ADDRESS(ROW(),COLUMN())),0,-1))<15,BJ63+7,IF(DAY(OFFSET(INDIRECT(ADDRESS(ROW(),COLUMN())),0,-1))>21,BJ63-7,BJ63+0))","v":"2030-05-16"},null,"2029-12-18",{"$f":"IF(DAY(OFFSET(INDIRECT(ADDRESS(ROW(),COLUMN())),0,-1))<15,BM63+7,IF(DAY(OFFSET(INDIRECT(ADDRESS(ROW(),COLUMN())),0,-1))>21,BM63-7,BM63+0))","v":"2029-12-18"},null,"2029-11-27",{"$f":"IF(DAY(OFFSET(INDIRECT(ADDRESS(ROW(),COLUMN())),0,-1))<21,BP63+7,IF(DAY(OFFSET(INDIRECT(ADDRESS(ROW(),COLUMN())),0,-1))>28,BP63-7,BP63+0))","v":"2029-11-27"},null,null,{"$f":"IF(DAY(BT62)=DAY(21),BT62-6,BT62+1)","v":"2028-03-16"},null,"2029-12-18",{"$f":"IF(DAY(OFFSET(INDIRECT(ADDRESS(ROW(),COLUMN())),0,-1))<15,BV63+7,IF(DAY(OFFSET(INDIRECT(ADDRESS(ROW(),COLUMN())),0,-1))>21,BV63-7,BV63+0))","v":"2029-12-18"},null,"2028-12-19",{"$f":"IF(DAY(OFFSET(INDIRECT(ADDRESS(ROW(),COLUMN())),0,-1))>21,BY63+7,IF(DAY(OFFSET(INDIRECT(ADDRESS(ROW(),COLUMN())),0,-1))<7,BY63+0,IF(AND(DAY(OFFSET(INDIRECT(ADDRESS(ROW(),COLUMN())),0,-1))>7,DAY(OFFSET(INDIRECT(ADDRESS(ROW(),COLUMN())),0,-1))<15),BY63+7,BY63+0)))","v":"2028-12-19"},null,"2027-09-21",null,null,null,null,null,"2029-12-06",{"$f":"IF(DAY(OFFSET(INDIRECT(ADDRESS(ROW(),COLUMN())),0,-1))<7,CH63+0,IF(DAY(OFFSET(INDIRECT(ADDRESS(ROW(),COLUMN())),0,-1))>7,CH63-7,CH63+0))","v":"2029-12-06"},null,"2028-06-08",null,null,"2029-12-11",{"$f":"IF(DAY(OFFSET(INDIRECT(ADDRESS(ROW(),COLUMN())),0,-1))<8,CN63+7,CN63+0)","v":"2029-12-11"},null,"2029-12-03",{"$f":"IF(DAY(OFFSET(INDIRECT(ADDRESS(ROW(),COLUMN())),0,-1))<7,CQ63+0,IF(DAY(OFFSET(INDIRECT(ADDRESS(ROW(),COLUMN())),0,-1))>7,CQ63-7,CQ63+0))","v":"2029-12-03"},null,"2029-12-03",{"$f":"IF(DAY(OFFSET(INDIRECT(ADDRESS(ROW(),COLUMN())),0,-1))<7,CT63+0,IF(DAY(OFFSET(INDIRECT(ADDRESS(ROW(),COLUMN())),0,-1))>7,CT63-7,CT63+0))+3","v":"2029-12-06"},null,"2029-12-03",{"$f":"IF(DAY(OFFSET(INDIRECT(ADDRESS(ROW(),COLUMN())),0,-1))<8,CW63+7,CW63+0)","v":"2029-12-10"},null,"2029-12-17",{"$f":"IF(DAY(OFFSET(INDIRECT(ADDRESS(ROW(),COLUMN())),0,-1))<15,CZ63+7,IF(DAY(OFFSET(INDIRECT(ADDRESS(ROW(),COLUMN())),0,-1))>21,CZ63-7,CZ63+0))","v":"2029-12-17"}]
[null,null,null,null,null,"Div 12","Gatonia",{"$f":"P40","v":"2028-08-15"},"Gatonia",7,7,21,null,"2029-01-01",{"$f":"IF(DAY(OFFSET(INDIRECT(ADDRESS(ROW(),COLUMN())),0,-1))>21,N64+7,IF(DAY(OFFSET(INDIRECT(ADDRESS(ROW(),COLUMN())),0,-1))<7,N64+0,IF(AND(DAY(OFFSET(INDIRECT(ADDRESS(ROW(),COLUMN())),0,-1))>7,DAY(OFFSET(INDIRECT(ADDRESS(ROW(),COLUMN())),0,-1))<15),N64+7,N64+0)))","v":"2029-01-01"},null,"2029-01-02",{"$f":"IF(DAY(OFFSET(INDIRECT(ADDRESS(ROW(),COLUMN())),0,-1))>21,Q64+7,IF(DAY(OFFSET(INDIRECT(ADDRESS(ROW(),COLUMN())),0,-1))<7,Q64+0,IF(AND(DAY(OFFSET(INDIRECT(ADDRESS(ROW(),COLUMN())),0,-1))>7,DAY(OFFSET(INDIRECT(ADDRESS(ROW(),COLUMN())),0,-1))<15),Q64+7,Q64+0)))","v":"2029-01-02"},null,"2030-01-08",{"$f":"IF(DAY(OFFSET(INDIRECT(ADDRESS(ROW(),COLUMN())),0,-1))<8,T64+7,T64+0)","v":"2030-01-08"},null,"2029-01-01",{"$f":"IF(DAY(OFFSET(INDIRECT(ADDRESS(ROW(),COLUMN())),0,-1))>21,W64+7,IF(DAY(OFFSET(INDIRECT(ADDRESS(ROW(),COLUMN())),0,-1))<7,W64+0,IF(AND(DAY(OFFSET(INDIRECT(ADDRESS(ROW(),COLUMN())),0,-1))>7,DAY(OFFSET(INDIRECT(ADDRESS(ROW(),COLUMN())),0,-1))<15),W64+7,W64+0)))","v":"2029-01-01"},null,"2030-01-10",{"$f":"IF(DAY(OFFSET(INDIRECT(ADDRESS(ROW(),COLUMN())),0,-1))=15,Z64-7,Z64+0)","v":"2030-01-10"},null,null,null,null,null,null,null,null,null,null,null,null,null,null,null,null,"2030-01-08",{"$f":"IF(DAY(OFFSET(INDIRECT(ADDRESS(ROW(),COLUMN())),0,-1))<8,AR64+7,AR64+0)","v":"2030-01-08"},null,"2029-01-01",{"$f":"IF(DAY(OFFSET(INDIRECT(ADDRESS(ROW(),COLUMN())),0,-1))>21,AU64+7,IF(DAY(OFFSET(INDIRECT(ADDRESS(ROW(),COLUMN())),0,-1))<7,AU64+0,IF(AND(DAY(OFFSET(INDIRECT(ADDRESS(ROW(),COLUMN())),0,-1))>7,DAY(OFFSET(INDIRECT(ADDRESS(ROW(),COLUMN())),0,-1))<15),AU64+7,AU64+0)))","v":"2029-01-01"},null,"2030-01-15",{"$f":"IF(DAY(OFFSET(INDIRECT(ADDRESS(ROW(),COLUMN())),0,-1))<16,AX64+7,AX64+0)","v":"2030-01-22"},null,"2029-01-04",{"$f":"IF(DAY(OFFSET(INDIRECT(ADDRESS(ROW(),COLUMN())),0,-1))>21,BA64+7,IF(DAY(OFFSET(INDIRECT(ADDRESS(ROW(),COLUMN())),0,-1))<7,BA64+0,IF(AND(DAY(OFFSET(INDIRECT(ADDRESS(ROW(),COLUMN())),0,-1))>7,DAY(OFFSET(INDIRECT(ADDRESS(ROW(),COLUMN())),0,-1))<15),BA64+7,BA64+0)))","v":"2029-01-04"},null,"2029-01-01",{"$f":"IF(DAY(OFFSET(INDIRECT(ADDRESS(ROW(),COLUMN())),0,-1))>21,BD64+7,IF(DAY(OFFSET(INDIRECT(ADDRESS(ROW(),COLUMN())),0,-1))<7,BD64+0,IF(AND(DAY(OFFSET(INDIRECT(ADDRESS(ROW(),COLUMN())),0,-1))>7,DAY(OFFSET(INDIRECT(ADDRESS(ROW(),COLUMN())),0,-1))<15),BD64+7,BD64+0)))","v":"2029-01-01"},null,"2029-01-02",null,null,"2030-06-20",{"$f":"IF(DAY(OFFSET(INDIRECT(ADDRESS(ROW(),COLUMN())),0,-1))<15,BJ64+7,IF(DAY(OFFSET(INDIRECT(ADDRESS(ROW(),COLUMN())),0,-1))>21,BJ64-7,BJ64+0))","v":"2030-06-20"},null,"2030-01-22",{"$f":"IF(DAY(OFFSET(INDIRECT(ADDRESS(ROW(),COLUMN())),0,-1))<15,BM64+7,IF(DAY(OFFSET(INDIRECT(ADDRESS(ROW(),COLUMN())),0,-1))>21,BM64-7,BM64+0))","v":"2030-01-15"},null,"2029-12-25",{"$f":"IF(DAY(OFFSET(INDIRECT(ADDRESS(ROW(),COLUMN())),0,-1))<21,BP64+7,IF(DAY(OFFSET(INDIRECT(ADDRESS(ROW(),COLUMN())),0,-1))>28,BP64-7,BP64+0))","v":"2029-12-25"},null,"2028-04-03",{"$f":"IF(DAY(OFFSET(INDIRECT(ADDRESS(ROW(),COLUMN())),0,-1))>21,BS64+7,IF(DAY(OFFSET(INDIRECT(ADDRESS(ROW(),COLUMN())),0,-1))<7,BS64+0,IF(AND(DAY(OFFSET(INDIRECT(ADDRESS(ROW(),COLUMN())),0,-1))>7,DAY(OFFSET(INDIRECT(ADDRESS(ROW(),COLUMN())),0,-1))<15),BS64+7,BS64+0)))","v":"2028-04-03"},null,"2030-01-22",{"$f":"IF(DAY(OFFSET(INDIRECT(ADDRESS(ROW(),COLUMN())),0,-1))<15,BV64+7,IF(DAY(OFFSET(INDIRECT(ADDRESS(ROW(),COLUMN())),0,-1))>21,BV64-7,BV64+0))","v":"2030-01-15"},null,"2029-01-02",{"$f":"IF(DAY(OFFSET(INDIRECT(ADDRESS(ROW(),COLUMN())),0,-1))>21,BY64+7,IF(DAY(OFFSET(INDIRECT(ADDRESS(ROW(),COLUMN())),0,-1))<7,BY64+0,IF(AND(DAY(OFFSET(INDIRECT(ADDRESS(ROW(),COLUMN())),0,-1))>7,DAY(OFFSET(INDIRECT(ADDRESS(ROW(),COLUMN())),0,-1))<15),BY64+7,BY64+0)))","v":"2029-01-02"},null,"2027-10-05",null,null,null,null,null,"2030-01-03",{"$f":"IF(DAY(OFFSET(INDIRECT(ADDRESS(ROW(),COLUMN())),0,-1))<7,CH64+0,IF(DAY(OFFSET(INDIRECT(ADDRESS(ROW(),COLUMN())),0,-1))>7,CH64-7,CH64+0))","v":"2030-01-03"},null,"2028-07-06",null,null,"2030-01-08",{"$f":"IF(DAY(OFFSET(INDIRECT(ADDRESS(ROW(),COLUMN())),0,-1))<8,CN64+7,CN64+0)","v":"2030-01-08"},null,"2030-01-07",{"$f":"IF(DAY(OFFSET(INDIRECT(ADDRESS(ROW(),COLUMN())),0,-1))<7,CQ64+0,IF(DAY(OFFSET(INDIRECT(ADDRESS(ROW(),COLUMN())),0,-1))>7,CQ64-7,CQ64+0))","v":"2030-01-07"},null,"2030-01-07",{"$f":"IF(DAY(OFFSET(INDIRECT(ADDRESS(ROW(),COLUMN())),0,-1))<7,CT64+0,IF(DAY(OFFSET(INDIRECT(ADDRESS(ROW(),COLUMN())),0,-1))>7,CT64-7,CT64+0))+3","v":"2030-01-10"},null,"2030-01-07",{"$f":"IF(DAY(OFFSET(INDIRECT(ADDRESS(ROW(),COLUMN())),0,-1))<8,CW64+7,CW64+0)","v":"2030-01-14"},null,"2030-01-21",{"$f":"IF(DAY(OFFSET(INDIRECT(ADDRESS(ROW(),COLUMN())),0,-1))<15,CZ64+7,IF(DAY(OFFSET(INDIRECT(ADDRESS(ROW(),COLUMN())),0,-1))>21,CZ64-7,CZ64+0))","v":"2030-01-21"}]
[null,null,null,null,null,"Div 12","Statesville",{"$f":"M40","v":"2028-08-21"},"Statesville",4,8,2,null,"2029-01-15",{"$f":"IF(DAY(OFFSET(INDIRECT(ADDRESS(ROW(),COLUMN())),0,-1))>21,N65+7,IF(DAY(OFFSET(INDIRECT(ADDRESS(ROW(),COLUMN())),0,-1))<7,N65+0,IF(AND(DAY(OFFSET(INDIRECT(ADDRESS(ROW(),COLUMN())),0,-1))>7,DAY(OFFSET(INDIRECT(ADDRESS(ROW(),COLUMN())),0,-1))<15),N65+7,N65+0)))","v":"2029-01-15"},null,"2029-01-16",{"$f":"IF(DAY(OFFSET(INDIRECT(ADDRESS(ROW(),COLUMN())),0,-1))>21,Q65+7,IF(DAY(OFFSET(INDIRECT(ADDRESS(ROW(),COLUMN())),0,-1))<7,Q65+0,IF(AND(DAY(OFFSET(INDIRECT(ADDRESS(ROW(),COLUMN())),0,-1))>7,DAY(OFFSET(INDIRECT(ADDRESS(ROW(),COLUMN())),0,-1))<15),Q65+7,Q65+0)))","v":"2029-01-16"},null,"2030-02-12",{"$f":"IF(DAY(OFFSET(INDIRECT(ADDRESS(ROW(),COLUMN())),0,-1))<8,T65+7,T65+0)","v":"2030-02-12"},null,"2029-01-15",{"$f":"IF(DAY(OFFSET(INDIRECT(ADDRESS(ROW(),COLUMN())),0,-1))>21,W65+7,IF(DAY(OFFSET(INDIRECT(ADDRESS(ROW(),COLUMN())),0,-1))<7,W65+0,IF(AND(DAY(OFFSET(INDIRECT(ADDRESS(ROW(),COLUMN())),0,-1))>7,DAY(OFFSET(INDIRECT(ADDRESS(ROW(),COLUMN())),0,-1))<15),W65+7,W65+0)))","v":"2029-01-15"},null,"2030-02-14",{"$f":"IF(DAY(OFFSET(INDIRECT(ADDRESS(ROW(),COLUMN())),0,-1))=15,Z65-7,Z65+0)","v":"2030-02-14"},null,null,null,null,null,null,null,null,null,null,null,null,null,null,null,null,"2030-02-12",{"$f":"IF(DAY(OFFSET(INDIRECT(ADDRESS(ROW(),COLUMN())),0,-1))<8,AR65+7,AR65+0)","v":"2030-02-12"},null,"2029-01-15",{"$f":"IF(DAY(OFFSET(INDIRECT(ADDRESS(ROW(),COLUMN())),0,-1))>21,AU65+7,IF(DAY(OFFSET(INDIRECT(ADDRESS(ROW(),COLUMN())),0,-1))<7,AU65+0,IF(AND(DAY(OFFSET(INDIRECT(ADDRESS(ROW(),COLUMN())),0,-1))>7,DAY(OFFSET(INDIRECT(ADDRESS(ROW(),COLUMN())),0,-1))<15),AU65+7,AU65+0)))","v":"2029-01-15"},null,"2030-02-19",{"$f":"IF(DAY(OFFSET(INDIRECT(ADDRESS(ROW(),COLUMN())),0,-1))<16,AX65+7,AX65+0)","v":"2030-02-19"},null,"2029-01-18",{"$f":"IF(DAY(OFFSET(INDIRECT(ADDRESS(ROW(),COLUMN())),0,-1))>21,BA65+7,IF(DAY(OFFSET(INDIRECT(ADDRESS(ROW(),COLUMN())),0,-1))<7,BA65+0,IF(AND(DAY(OFFSET(INDIRECT(ADDRESS(ROW(),COLUMN())),0,-1))>7,DAY(OFFSET(INDIRECT(ADDRESS(ROW(),COLUMN())),0,-1))<15),BA65+7,BA65+0)))","v":"2029-01-18"},null,"2029-01-16",{"$f":"IF(DAY(OFFSET(INDIRECT(ADDRESS(ROW(),COLUMN())),0,-1))>21,BD65+7,IF(DAY(OFFSET(INDIRECT(ADDRESS(ROW(),COLUMN())),0,-1))<7,BD65+0,IF(AND(DAY(OFFSET(INDIRECT(ADDRESS(ROW(),COLUMN())),0,-1))>7,DAY(OFFSET(INDIRECT(ADDRESS(ROW(),COLUMN())),0,-1))<15),BD65+7,BD65+0)))","v":"2029-01-16"},null,"2029-01-16",null,null,"2030-07-18",{"$f":"IF(DAY(OFFSET(INDIRECT(ADDRESS(ROW(),COLUMN())),0,-1))<15,BJ65+7,IF(DAY(OFFSET(INDIRECT(ADDRESS(ROW(),COLUMN())),0,-1))>21,BJ65-7,BJ65+0))","v":"2030-07-18"},null,"2030-02-19",{"$f":"IF(DAY(OFFSET(INDIRECT(ADDRESS(ROW(),COLUMN())),0,-1))<15,BM65+7,IF(DAY(OFFSET(INDIRECT(ADDRESS(ROW(),COLUMN())),0,-1))>21,BM65-7,BM65+0))","v":"2030-02-19"},null,"2030-01-29",{"$f":"IF(DAY(OFFSET(INDIRECT(ADDRESS(ROW(),COLUMN())),0,-1))<21,BP65+7,IF(DAY(OFFSET(INDIRECT(ADDRESS(ROW(),COLUMN())),0,-1))>28,BP65-7,BP65+0))","v":"2030-01-22"},null,"2028-04-17",{"$f":"IF((DAY(BS65))<DAY(13),BS65+10,IF((DAY(BS65))>=DAY(20),BS65-5,BS65+2))","v":"2028-04-19"},null,"2030-02-19",{"$f":"IF(DAY(OFFSET(INDIRECT(ADDRESS(ROW(),COLUMN())),0,-1))<15,BV65+7,IF(DAY(OFFSET(INDIRECT(ADDRESS(ROW(),COLUMN())),0,-1))>21,BV65-7,BV65+0))","v":"2030-02-19"},null,"2029-01-16",{"$f":"IF(DAY(OFFSET(INDIRECT(ADDRESS(ROW(),COLUMN())),0,-1))>21,BY65+7,IF(DAY(OFFSET(INDIRECT(ADDRESS(ROW(),COLUMN())),0,-1))<7,BY65+0,IF(AND(DAY(OFFSET(INDIRECT(ADDRESS(ROW(),COLUMN())),0,-1))>7,DAY(OFFSET(INDIRECT(ADDRESS(ROW(),COLUMN())),0,-1))<15),BY65+7,BY65+0)))","v":"2029-01-16"},null,"2027-10-19",null,null,null,null,null,"2030-02-07",{"$f":"IF(DAY(OFFSET(INDIRECT(ADDRESS(ROW(),COLUMN())),0,-1))<7,CH65+0,IF(DAY(OFFSET(INDIRECT(ADDRESS(ROW(),COLUMN())),0,-1))>7,CH65-7,CH65+0))","v":"2030-02-07"},null,"2028-08-03",null,null,"2030-02-12",{"$f":"IF(DAY(OFFSET(INDIRECT(ADDRESS(ROW(),COLUMN())),0,-1))<8,CN65+7,CN65+0)","v":"2030-02-12"},null,"2030-02-04",{"$f":"IF(DAY(OFFSET(INDIRECT(ADDRESS(ROW(),COLUMN())),0,-1))<7,CQ65+0,IF(DAY(OFFSET(INDIRECT(ADDRESS(ROW(),COLUMN())),0,-1))>7,CQ65-7,CQ65+0))","v":"2030-02-04"},null,"2030-02-04",{"$f":"IF(DAY(OFFSET(INDIRECT(ADDRESS(ROW(),COLUMN())),0,-1))<7,CT65+0,IF(DAY(OFFSET(INDIRECT(ADDRESS(ROW(),COLUMN())),0,-1))>7,CT65-7,CT65+0))+3","v":"2030-02-07"},null,"2030-02-04",{"$f":"IF(DAY(OFFSET(INDIRECT(ADDRESS(ROW(),COLUMN())),0,-1))<8,CW65+7,CW65+0)","v":"2030-02-11"},null,"2030-02-18",{"$f":"IF(DAY(OFFSET(INDIRECT(ADDRESS(ROW(),COLUMN())),0,-1))<15,CZ65+7,IF(DAY(OFFSET(INDIRECT(ADDRESS(ROW(),COLUMN())),0,-1))>21,CZ65-7,CZ65+0))","v":"2030-02-18"}]
[null,null,null,null,null,"Div 12","Shelby",{"$f":"M40","v":"2028-08-21"},"Shelby",45,5,0,null,"2029-02-05",{"$f":"IF(DAY(OFFSET(INDIRECT(ADDRESS(ROW(),COLUMN())),0,-1))>21,N66+7,IF(DAY(OFFSET(INDIRECT(ADDRESS(ROW(),COLUMN())),0,-1))<7,N66+0,IF(AND(DAY(OFFSET(INDIRECT(ADDRESS(ROW(),COLUMN())),0,-1))>7,DAY(OFFSET(INDIRECT(ADDRESS(ROW(),COLUMN())),0,-1))<15),N66+7,N66+0)))","v":"2029-02-05"},null,"2029-02-06",{"$f":"IF(DAY(OFFSET(INDIRECT(ADDRESS(ROW(),COLUMN())),0,-1))>21,Q66+7,IF(DAY(OFFSET(INDIRECT(ADDRESS(ROW(),COLUMN())),0,-1))<7,Q66+0,IF(AND(DAY(OFFSET(INDIRECT(ADDRESS(ROW(),COLUMN())),0,-1))>7,DAY(OFFSET(INDIRECT(ADDRESS(ROW(),COLUMN())),0,-1))<15),Q66+7,Q66+0)))","v":"2029-02-06"},null,"2030-03-12",{"$f":"IF(DAY(OFFSET(INDIRECT(ADDRESS(ROW(),COLUMN())),0,-1))<8,T66+7,T66+0)","v":"2030-03-12"},null,"2029-02-05",{"$f":"IF(DAY(OFFSET(INDIRECT(ADDRESS(ROW(),COLUMN())),0,-1))>21,W66+7,IF(DAY(OFFSET(INDIRECT(ADDRESS(ROW(),COLUMN())),0,-1))<7,W66+0,IF(AND(DAY(OFFSET(INDIRECT(ADDRESS(ROW(),COLUMN())),0,-1))>7,DAY(OFFSET(INDIRECT(ADDRESS(ROW(),COLUMN())),0,-1))<15),W66+7,W66+0)))","v":"2029-02-05"},null,"2030-03-14",{"$f":"IF(DAY(OFFSET(INDIRECT(ADDRESS(ROW(),COLUMN())),0,-1))=15,Z66-7,Z66+0)","v":"2030-03-14"},null,null,null,null,null,null,null,null,null,null,null,null,null,null,null,null,"2030-03-12",{"$f":"IF(DAY(OFFSET(INDIRECT(ADDRESS(ROW(),COLUMN())),0,-1))<8,AR66+7,AR66+0)","v":"2030-03-12"},null,"2029-02-05",{"$f":"IF(DAY(OFFSET(INDIRECT(ADDRESS(ROW(),COLUMN())),0,-1))>21,AU66+7,IF(DAY(OFFSET(INDIRECT(ADDRESS(ROW(),COLUMN())),0,-1))<7,AU66+0,IF(AND(DAY(OFFSET(INDIRECT(ADDRESS(ROW(),COLUMN())),0,-1))>7,DAY(OFFSET(INDIRECT(ADDRESS(ROW(),COLUMN())),0,-1))<15),AU66+7,AU66+0)))","v":"2029-02-05"},null,"2030-03-19",{"$f":"IF(DAY(OFFSET(INDIRECT(ADDRESS(ROW(),COLUMN())),0,-1))<16,AX66+7,AX66+0)","v":"2030-03-19"},null,"2029-02-01",{"$f":"IF(DAY(OFFSET(INDIRECT(ADDRESS(ROW(),COLUMN())),0,-1))>21,BA66+7,IF(DAY(OFFSET(INDIRECT(ADDRESS(ROW(),COLUMN())),0,-1))<7,BA66+0,IF(AND(DAY(OFFSET(INDIRECT(ADDRESS(ROW(),COLUMN())),0,-1))>7,DAY(OFFSET(INDIRECT(ADDRESS(ROW(),COLUMN())),0,-1))<15),BA66+7,BA66+0)))","v":"2029-02-01"},null,"2029-02-05",{"$f":"IF(DAY(OFFSET(INDIRECT(ADDRESS(ROW(),COLUMN())),0,-1))>21,BD66+7,IF(DAY(OFFSET(INDIRECT(ADDRESS(ROW(),COLUMN())),0,-1))<7,BD66+0,IF(AND(DAY(OFFSET(INDIRECT(ADDRESS(ROW(),COLUMN())),0,-1))>7,DAY(OFFSET(INDIRECT(ADDRESS(ROW(),COLUMN())),0,-1))<15),BD66+7,BD66+0)))","v":"2029-02-05"},null,"2029-01-30",null,null,"2030-08-22",{"$f":"IF(DAY(OFFSET(INDIRECT(ADDRESS(ROW(),COLUMN())),0,-1))<15,BJ66+7,IF(DAY(OFFSET(INDIRECT(ADDRESS(ROW(),COLUMN())),0,-1))>21,BJ66-7,BJ66+0))","v":"2030-08-15"},null,"2030-03-19",{"$f":"IF(DAY(OFFSET(INDIRECT(ADDRESS(ROW(),COLUMN())),0,-1))<15,BM66+7,IF(DAY(OFFSET(INDIRECT(ADDRESS(ROW(),COLUMN())),0,-1))>21,BM66-7,BM66+0))","v":"2030-03-19"},null,"2030-02-26",{"$f":"IF(DAY(OFFSET(INDIRECT(ADDRESS(ROW(),COLUMN())),0,-1))<21,BP66+7,IF(DAY(OFFSET(INDIRECT(ADDRESS(ROW(),COLUMN())),0,-1))>28,BP66-7,BP66+0))","v":"2030-02-26"},null,null,{"$f":"IF(DAY(BT65)=DAY(21),BT65-6,BT65+1)","v":"2028-04-20"},null,"2030-03-19",{"$f":"IF(DAY(OFFSET(INDIRECT(ADDRESS(ROW(),COLUMN())),0,-1))<15,BV66+7,IF(DAY(OFFSET(INDIRECT(ADDRESS(ROW(),COLUMN())),0,-1))>21,BV66-7,BV66+0))","v":"2030-03-19"},null,"2029-02-06",{"$f":"IF(DAY(OFFSET(INDIRECT(ADDRESS(ROW(),COLUMN())),0,-1))>21,BY66+7,IF(DAY(OFFSET(INDIRECT(ADDRESS(ROW(),COLUMN())),0,-1))<7,BY66+0,IF(AND(DAY(OFFSET(INDIRECT(ADDRESS(ROW(),COLUMN())),0,-1))>7,DAY(OFFSET(INDIRECT(ADDRESS(ROW(),COLUMN())),0,-1))<15),BY66+7,BY66+0)))","v":"2029-02-06"},null,"2027-11-02",null,null,null,null,null,"2030-03-07",{"$f":"IF(DAY(OFFSET(INDIRECT(ADDRESS(ROW(),COLUMN())),0,-1))<7,CH66+0,IF(DAY(OFFSET(INDIRECT(ADDRESS(ROW(),COLUMN())),0,-1))>7,CH66-7,CH66+0))","v":"2030-03-07"},null,"2028-09-07",null,null,"2030-03-12",{"$f":"IF(DAY(OFFSET(INDIRECT(ADDRESS(ROW(),COLUMN())),0,-1))<8,CN66+7,CN66+0)","v":"2030-03-12"},null,"2030-03-04",{"$f":"IF(DAY(OFFSET(INDIRECT(ADDRESS(ROW(),COLUMN())),0,-1))<7,CQ66+0,IF(DAY(OFFSET(INDIRECT(ADDRESS(ROW(),COLUMN())),0,-1))>7,CQ66-7,CQ66+0))","v":"2030-03-04"},null,"2030-03-04",{"$f":"IF(DAY(OFFSET(INDIRECT(ADDRESS(ROW(),COLUMN())),0,-1))<7,CT66+0,IF(DAY(OFFSET(INDIRECT(ADDRESS(ROW(),COLUMN())),0,-1))>7,CT66-7,CT66+0))+3","v":"2030-03-07"},null,"2030-03-04",{"$f":"IF(DAY(OFFSET(INDIRECT(ADDRESS(ROW(),COLUMN())),0,-1))<8,CW66+7,CW66+0)","v":"2030-03-11"},null,"2030-03-18",{"$f":"IF(DAY(OFFSET(INDIRECT(ADDRESS(ROW(),COLUMN())),0,-1))<15,CZ66+7,IF(DAY(OFFSET(INDIRECT(ADDRESS(ROW(),COLUMN())),0,-1))>21,CZ66-7,CZ66+0))","v":"2030-03-18"}]
[null,null,null,null,null,"Div 12","Mount Holly",{"$f":"I34","v":"2028-08-14"},"Mount Holly",15,14,20,null,"2029-02-19",{"$f":"IF(DAY(OFFSET(INDIRECT(ADDRESS(ROW(),COLUMN())),0,-1))>21,N67+7,IF(DAY(OFFSET(INDIRECT(ADDRESS(ROW(),COLUMN())),0,-1))<7,N67+0,IF(AND(DAY(OFFSET(INDIRECT(ADDRESS(ROW(),COLUMN())),0,-1))>7,DAY(OFFSET(INDIRECT(ADDRESS(ROW(),COLUMN())),0,-1))<15),N67+7,N67+0)))","v":"2029-02-19"},null,"2029-02-20",{"$f":"IF(DAY(OFFSET(INDIRECT(ADDRESS(ROW(),COLUMN())),0,-1))>21,Q67+7,IF(DAY(OFFSET(INDIRECT(ADDRESS(ROW(),COLUMN())),0,-1))<7,Q67+0,IF(AND(DAY(OFFSET(INDIRECT(ADDRESS(ROW(),COLUMN())),0,-1))>7,DAY(OFFSET(INDIRECT(ADDRESS(ROW(),COLUMN())),0,-1))<15),Q67+7,Q67+0)))","v":"2029-02-20"},null,"2030-04-09",{"$f":"IF(DAY(OFFSET(INDIRECT(ADDRESS(ROW(),COLUMN())),0,-1))<8,T67+7,T67+0)","v":"2030-04-09"},null,"2029-02-19",{"$f":"IF(DAY(OFFSET(INDIRECT(ADDRESS(ROW(),COLUMN())),0,-1))>21,W67+7,IF(DAY(OFFSET(INDIRECT(ADDRESS(ROW(),COLUMN())),0,-1))<7,W67+0,IF(AND(DAY(OFFSET(INDIRECT(ADDRESS(ROW(),COLUMN())),0,-1))>7,DAY(OFFSET(INDIRECT(ADDRESS(ROW(),COLUMN())),0,-1))<15),W67+7,W67+0)))","v":"2029-02-19"},null,"2030-04-11",{"$f":"IF(DAY(OFFSET(INDIRECT(ADDRESS(ROW(),COLUMN())),0,-1))=15,Z67-7,Z67+0)","v":"2030-04-11"},null,null,null,null,null,null,null,null,null,null,null,null,null,null,null,null,"2030-04-09",{"$f":"IF(DAY(OFFSET(INDIRECT(ADDRESS(ROW(),COLUMN())),0,-1))<8,AR67+7,AR67+0)","v":"2030-04-09"},null,"2029-02-19",{"$f":"IF(DAY(OFFSET(INDIRECT(ADDRESS(ROW(),COLUMN())),0,-1))>21,AU67+7,IF(DAY(OFFSET(INDIRECT(ADDRESS(ROW(),COLUMN())),0,-1))<7,AU67+0,IF(AND(DAY(OFFSET(INDIRECT(ADDRESS(ROW(),COLUMN())),0,-1))>7,DAY(OFFSET(INDIRECT(ADDRESS(ROW(),COLUMN())),0,-1))<15),AU67+7,AU67+0)))","v":"2029-02-19"},null,"2030-04-16",{"$f":"IF(DAY(OFFSET(INDIRECT(ADDRESS(ROW(),COLUMN())),0,-1))<16,AX67+7,AX67+0)","v":"2030-04-16"},null,"2029-02-15",{"$f":"IF(DAY(OFFSET(INDIRECT(ADDRESS(ROW(),COLUMN())),0,-1))>21,BA67+7,IF(DAY(OFFSET(INDIRECT(ADDRESS(ROW(),COLUMN())),0,-1))<7,BA67+0,IF(AND(DAY(OFFSET(INDIRECT(ADDRESS(ROW(),COLUMN())),0,-1))>7,DAY(OFFSET(INDIRECT(ADDRESS(ROW(),COLUMN())),0,-1))<15),BA67+7,BA67+0)))","v":"2029-02-15"},null,"2029-02-20",{"$f":"IF(DAY(OFFSET(INDIRECT(ADDRESS(ROW(),COLUMN())),0,-1))>21,BD67+7,IF(DAY(OFFSET(INDIRECT(ADDRESS(ROW(),COLUMN())),0,-1))<7,BD67+0,IF(AND(DAY(OFFSET(INDIRECT(ADDRESS(ROW(),COLUMN())),0,-1))>7,DAY(OFFSET(INDIRECT(ADDRESS(ROW(),COLUMN())),0,-1))<15),BD67+7,BD67+0)))","v":"2029-02-20"},null,"2029-02-13",null,null,"2030-09-19",{"$f":"IF(DAY(OFFSET(INDIRECT(ADDRESS(ROW(),COLUMN())),0,-1))<15,BJ67+7,IF(DAY(OFFSET(INDIRECT(ADDRESS(ROW(),COLUMN())),0,-1))>21,BJ67-7,BJ67+0))","v":"2030-09-19"},null,"2030-04-16",{"$f":"IF(DAY(OFFSET(INDIRECT(ADDRESS(ROW(),COLUMN())),0,-1))<15,BM67+7,IF(DAY(OFFSET(INDIRECT(ADDRESS(ROW(),COLUMN())),0,-1))>21,BM67-7,BM67+0))","v":"2030-04-16"},null,"2030-03-26",{"$f":"IF(DAY(OFFSET(INDIRECT(ADDRESS(ROW(),COLUMN())),0,-1))<21,BP67+7,IF(DAY(OFFSET(INDIRECT(ADDRESS(ROW(),COLUMN())),0,-1))>28,BP67-7,BP67+0))","v":"2030-03-26"},null,"2028-05-01",{"$f":"IF(DAY(OFFSET(INDIRECT(ADDRESS(ROW(),COLUMN())),0,-1))>21,BS67+7,IF(DAY(OFFSET(INDIRECT(ADDRESS(ROW(),COLUMN())),0,-1))<7,BS67+0,IF(AND(DAY(OFFSET(INDIRECT(ADDRESS(ROW(),COLUMN())),0,-1))>7,DAY(OFFSET(INDIRECT(ADDRESS(ROW(),COLUMN())),0,-1))<15),BS67+7,BS67+0)))","v":"2028-05-01"},null,"2030-04-16",{"$f":"IF(DAY(OFFSET(INDIRECT(ADDRESS(ROW(),COLUMN())),0,-1))<15,BV67+7,IF(DAY(OFFSET(INDIRECT(ADDRESS(ROW(),COLUMN())),0,-1))>21,BV67-7,BV67+0))","v":"2030-04-16"},null,"2029-02-20",{"$f":"IF(DAY(OFFSET(INDIRECT(ADDRESS(ROW(),COLUMN())),0,-1))>21,BY67+7,IF(DAY(OFFSET(INDIRECT(ADDRESS(ROW(),COLUMN())),0,-1))<7,BY67+0,IF(AND(DAY(OFFSET(INDIRECT(ADDRESS(ROW(),COLUMN())),0,-1))>7,DAY(OFFSET(INDIRECT(ADDRESS(ROW(),COLUMN())),0,-1))<15),BY67+7,BY67+0)))","v":"2029-02-20"},null,"2027-11-16",null,null,null,null,null,"2030-04-04",{"$f":"IF(DAY(OFFSET(INDIRECT(ADDRESS(ROW(),COLUMN())),0,-1))<7,CH67+0,IF(DAY(OFFSET(INDIRECT(ADDRESS(ROW(),COLUMN())),0,-1))>7,CH67-7,CH67+0))","v":"2030-04-04"},null,"2028-10-05",null,null,"2030-04-09",{"$f":"IF(DAY(OFFSET(INDIRECT(ADDRESS(ROW(),COLUMN())),0,-1))<8,CN67+7,CN67+0)","v":"2030-04-09"},null,"2030-04-08",{"$f":"IF(DAY(OFFSET(INDIRECT(ADDRESS(ROW(),COLUMN())),0,-1))<7,CQ67+0,IF(DAY(OFFSET(INDIRECT(ADDRESS(ROW(),COLUMN())),0,-1))>7,CQ67-7,CQ67+0))","v":"2030-04-01"},null,"2030-04-08",{"$f":"IF(DAY(OFFSET(INDIRECT(ADDRESS(ROW(),COLUMN())),0,-1))<7,CT67+0,IF(DAY(OFFSET(INDIRECT(ADDRESS(ROW(),COLUMN())),0,-1))>7,CT67-7,CT67+0))+3","v":"2030-04-04"},null,"2030-04-08",{"$f":"IF(DAY(OFFSET(INDIRECT(ADDRESS(ROW(),COLUMN())),0,-1))<8,CW67+7,CW67+0)","v":"2030-04-08"},null,"2030-04-22",{"$f":"IF(DAY(OFFSET(INDIRECT(ADDRESS(ROW(),COLUMN())),0,-1))<15,CZ67+7,IF(DAY(OFFSET(INDIRECT(ADDRESS(ROW(),COLUMN())),0,-1))>21,CZ67-7,CZ67+0))","v":"2030-04-15"}]
[null,null,null,null,null,"Div 12","Kings Mountain",{"$f":"CJ40","v":"2028-08-10"},"Kings Mountain",10,7,14,null,"2029-03-05",{"$f":"IF(DAY(OFFSET(INDIRECT(ADDRESS(ROW(),COLUMN())),0,-1))>21,N68+7,IF(DAY(OFFSET(INDIRECT(ADDRESS(ROW(),COLUMN())),0,-1))<7,N68+0,IF(AND(DAY(OFFSET(INDIRECT(ADDRESS(ROW(),COLUMN())),0,-1))>7,DAY(OFFSET(INDIRECT(ADDRESS(ROW(),COLUMN())),0,-1))<15),N68+7,N68+0)))","v":"2029-03-05"},null,"2029-03-06",{"$f":"IF(DAY(OFFSET(INDIRECT(ADDRESS(ROW(),COLUMN())),0,-1))>21,Q68+7,IF(DAY(OFFSET(INDIRECT(ADDRESS(ROW(),COLUMN())),0,-1))<7,Q68+0,IF(AND(DAY(OFFSET(INDIRECT(ADDRESS(ROW(),COLUMN())),0,-1))>7,DAY(OFFSET(INDIRECT(ADDRESS(ROW(),COLUMN())),0,-1))<15),Q68+7,Q68+0)))","v":"2029-03-06"},null,"2030-05-07",{"$f":"IF(DAY(OFFSET(INDIRECT(ADDRESS(ROW(),COLUMN())),0,-1))<8,T68+7,T68+0)","v":"2030-05-14"},null,"2029-03-05",{"$f":"IF(DAY(OFFSET(INDIRECT(ADDRESS(ROW(),COLUMN())),0,-1))>21,W68+7,IF(DAY(OFFSET(INDIRECT(ADDRESS(ROW(),COLUMN())),0,-1))<7,W68+0,IF(AND(DAY(OFFSET(INDIRECT(ADDRESS(ROW(),COLUMN())),0,-1))>7,DAY(OFFSET(INDIRECT(ADDRESS(ROW(),COLUMN())),0,-1))<15),W68+7,W68+0)))","v":"2029-03-05"},null,"2030-05-09",{"$f":"IF(DAY(OFFSET(INDIRECT(ADDRESS(ROW(),COLUMN())),0,-1))=15,Z68-7,Z68+0)","v":"2030-05-09"},null,null,null,null,null,null,null,null,null,null,null,null,null,null,null,null,"2030-05-07",{"$f":"IF(DAY(OFFSET(INDIRECT(ADDRESS(ROW(),COLUMN())),0,-1))<8,AR68+7,AR68+0)","v":"2030-05-14"},null,"2029-03-05",{"$f":"IF(DAY(OFFSET(INDIRECT(ADDRESS(ROW(),COLUMN())),0,-1))>21,AU68+7,IF(DAY(OFFSET(INDIRECT(ADDRESS(ROW(),COLUMN())),0,-1))<7,AU68+0,IF(AND(DAY(OFFSET(INDIRECT(ADDRESS(ROW(),COLUMN())),0,-1))>7,DAY(OFFSET(INDIRECT(ADDRESS(ROW(),COLUMN())),0,-1))<15),AU68+7,AU68+0)))","v":"2029-03-05"},null,"2030-05-21",{"$f":"IF(DAY(OFFSET(INDIRECT(ADDRESS(ROW(),COLUMN())),0,-1))<16,AX68+7,AX68+0)","v":"2030-05-21"},null,"2029-03-01",{"$f":"IF(DAY(OFFSET(INDIRECT(ADDRESS(ROW(),COLUMN())),0,-1))>21,BA68+7,IF(DAY(OFFSET(INDIRECT(ADDRESS(ROW(),COLUMN())),0,-1))<7,BA68+0,IF(AND(DAY(OFFSET(INDIRECT(ADDRESS(ROW(),COLUMN())),0,-1))>7,DAY(OFFSET(INDIRECT(ADDRESS(ROW(),COLUMN())),0,-1))<15),BA68+7,BA68+0)))","v":"2029-03-01"},null,"2029-03-05",{"$f":"IF(DAY(OFFSET(INDIRECT(ADDRESS(ROW(),COLUMN())),0,-1))>21,BD68+7,IF(DAY(OFFSET(INDIRECT(ADDRESS(ROW(),COLUMN())),0,-1))<7,BD68+0,IF(AND(DAY(OFFSET(INDIRECT(ADDRESS(ROW(),COLUMN())),0,-1))>7,DAY(OFFSET(INDIRECT(ADDRESS(ROW(),COLUMN())),0,-1))<15),BD68+7,BD68+0)))","v":"2029-03-05"},null,"2029-02-27",null,null,"2030-10-17",{"$f":"IF(DAY(OFFSET(INDIRECT(ADDRESS(ROW(),COLUMN())),0,-1))<15,BJ68+7,IF(DAY(OFFSET(INDIRECT(ADDRESS(ROW(),COLUMN())),0,-1))>21,BJ68-7,BJ68+0))","v":"2030-10-17"},null,"2030-05-21",{"$f":"IF(DAY(OFFSET(INDIRECT(ADDRESS(ROW(),COLUMN())),0,-1))<15,BM68+7,IF(DAY(OFFSET(INDIRECT(ADDRESS(ROW(),COLUMN())),0,-1))>21,BM68-7,BM68+0))","v":"2030-05-21"},null,"2030-04-23",{"$f":"IF(DAY(OFFSET(INDIRECT(ADDRESS(ROW(),COLUMN())),0,-1))<21,BP68+7,IF(DAY(OFFSET(INDIRECT(ADDRESS(ROW(),COLUMN())),0,-1))>28,BP68-7,BP68+0))","v":"2030-04-23"},null,"2028-05-15",{"$f":"IF((DAY(BS68))<DAY(13),BS68+10,IF((DAY(BS68))>=DAY(20),BS68-5,BS68+2))","v":"2028-05-17"},null,"2030-05-21",{"$f":"IF(DAY(OFFSET(INDIRECT(ADDRESS(ROW(),COLUMN())),0,-1))<15,BV68+7,IF(DAY(OFFSET(INDIRECT(ADDRESS(ROW(),COLUMN())),0,-1))>21,BV68-7,BV68+0))","v":"2030-05-21"},null,"2029-03-06",{"$f":"IF(DAY(OFFSET(INDIRECT(ADDRESS(ROW(),COLUMN())),0,-1))>21,BY68+7,IF(DAY(OFFSET(INDIRECT(ADDRESS(ROW(),COLUMN())),0,-1))<7,BY68+0,IF(AND(DAY(OFFSET(INDIRECT(ADDRESS(ROW(),COLUMN())),0,-1))>7,DAY(OFFSET(INDIRECT(ADDRESS(ROW(),COLUMN())),0,-1))<15),BY68+7,BY68+0)))","v":"2029-03-06"},null,"2027-12-07",null,null,null,null,null,"2030-05-02",{"$f":"IF(DAY(OFFSET(INDIRECT(ADDRESS(ROW(),COLUMN())),0,-1))<7,CH68+0,IF(DAY(OFFSET(INDIRECT(ADDRESS(ROW(),COLUMN())),0,-1))>7,CH68-7,CH68+0))","v":"2030-05-02"},null,"2028-11-02",null,null,"2030-05-07",{"$f":"IF(DAY(OFFSET(INDIRECT(ADDRESS(ROW(),COLUMN())),0,-1))<8,CN68+7,CN68+0)","v":"2030-05-14"},null,"2030-05-06",{"$f":"IF(DAY(OFFSET(INDIRECT(ADDRESS(ROW(),COLUMN())),0,-1))<7,CQ68+0,IF(DAY(OFFSET(INDIRECT(ADDRESS(ROW(),COLUMN())),0,-1))>7,CQ68-7,CQ68+0))","v":"2030-05-06"},null,"2030-05-06",{"$f":"IF(DAY(OFFSET(INDIRECT(ADDRESS(ROW(),COLUMN())),0,-1))<7,CT68+0,IF(DAY(OFFSET(INDIRECT(ADDRESS(ROW(),COLUMN())),0,-1))>7,CT68-7,CT68+0))+3","v":"2030-05-09"},null,"2030-05-06",{"$f":"IF(DAY(OFFSET(INDIRECT(ADDRESS(ROW(),COLUMN())),0,-1))<8,CW68+7,CW68+0)","v":"2030-05-13"},null,"2030-05-20",{"$f":"IF(DAY(OFFSET(INDIRECT(ADDRESS(ROW(),COLUMN())),0,-1))<15,CZ68+7,IF(DAY(OFFSET(INDIRECT(ADDRESS(ROW(),COLUMN())),0,-1))>21,CZ68-7,CZ68+0))","v":"2030-05-20"}]
[null,null,null,null,null,"Div 12","Newton",{"$f":"AE31","v":"2028-09-05"},"Newton",0,7,0,null,"2029-03-19",{"$f":"IF(DAY(OFFSET(INDIRECT(ADDRESS(ROW(),COLUMN())),0,-1))>21,N69+7,IF(DAY(OFFSET(INDIRECT(ADDRESS(ROW(),COLUMN())),0,-1))<7,N69+0,IF(AND(DAY(OFFSET(INDIRECT(ADDRESS(ROW(),COLUMN())),0,-1))>7,DAY(OFFSET(INDIRECT(ADDRESS(ROW(),COLUMN())),0,-1))<15),N69+7,N69+0)))","v":"2029-03-19"},null,"2029-03-20",{"$f":"IF(DAY(OFFSET(INDIRECT(ADDRESS(ROW(),COLUMN())),0,-1))>21,Q69+7,IF(DAY(OFFSET(INDIRECT(ADDRESS(ROW(),COLUMN())),0,-1))<7,Q69+0,IF(AND(DAY(OFFSET(INDIRECT(ADDRESS(ROW(),COLUMN())),0,-1))>7,DAY(OFFSET(INDIRECT(ADDRESS(ROW(),COLUMN())),0,-1))<15),Q69+7,Q69+0)))","v":"2029-03-20"},null,"2030-06-11",{"$f":"IF(DAY(OFFSET(INDIRECT(ADDRESS(ROW(),COLUMN())),0,-1))<8,T69+7,T69+0)","v":"2030-06-11"},null,"2029-03-19",{"$f":"IF(DAY(OFFSET(INDIRECT(ADDRESS(ROW(),COLUMN())),0,-1))>21,W69+7,IF(DAY(OFFSET(INDIRECT(ADDRESS(ROW(),COLUMN())),0,-1))<7,W69+0,IF(AND(DAY(OFFSET(INDIRECT(ADDRESS(ROW(),COLUMN())),0,-1))>7,DAY(OFFSET(INDIRECT(ADDRESS(ROW(),COLUMN())),0,-1))<15),W69+7,W69+0)))","v":"2029-03-19"},null,"2030-06-13",{"$f":"IF(DAY(OFFSET(INDIRECT(ADDRESS(ROW(),COLUMN())),0,-1))=15,Z69-7,Z69+0)","v":"2030-06-13"},null,null,null,null,null,null,null,null,null,null,null,null,null,null,null,null,"2030-06-11",{"$f":"IF(DAY(OFFSET(INDIRECT(ADDRESS(ROW(),COLUMN())),0,-1))<8,AR69+7,AR69+0)","v":"2030-06-11"},null,"2029-03-19",{"$f":"IF(DAY(OFFSET(INDIRECT(ADDRESS(ROW(),COLUMN())),0,-1))>21,AU69+7,IF(DAY(OFFSET(INDIRECT(ADDRESS(ROW(),COLUMN())),0,-1))<7,AU69+0,IF(AND(DAY(OFFSET(INDIRECT(ADDRESS(ROW(),COLUMN())),0,-1))>7,DAY(OFFSET(INDIRECT(ADDRESS(ROW(),COLUMN())),0,-1))<15),AU69+7,AU69+0)))","v":"2029-03-19"},null,"2030-06-18",{"$f":"IF(DAY(OFFSET(INDIRECT(ADDRESS(ROW(),COLUMN())),0,-1))<16,AX69+7,AX69+0)","v":"2030-06-18"},null,"2029-03-15",{"$f":"IF(DAY(OFFSET(INDIRECT(ADDRESS(ROW(),COLUMN())),0,-1))>21,BA69+7,IF(DAY(OFFSET(INDIRECT(ADDRESS(ROW(),COLUMN())),0,-1))<7,BA69+0,IF(AND(DAY(OFFSET(INDIRECT(ADDRESS(ROW(),COLUMN())),0,-1))>7,DAY(OFFSET(INDIRECT(ADDRESS(ROW(),COLUMN())),0,-1))<15),BA69+7,BA69+0)))","v":"2029-03-15"},null,"2029-03-20",{"$f":"IF(DAY(OFFSET(INDIRECT(ADDRESS(ROW(),COLUMN())),0,-1))>21,BD69+7,IF(DAY(OFFSET(INDIRECT(ADDRESS(ROW(),COLUMN())),0,-1))<7,BD69+0,IF(AND(DAY(OFFSET(INDIRECT(ADDRESS(ROW(),COLUMN())),0,-1))>7,DAY(OFFSET(INDIRECT(ADDRESS(ROW(),COLUMN())),0,-1))<15),BD69+7,BD69+0)))","v":"2029-03-20"},null,"2029-03-13",null,null,"2030-11-21",{"$f":"IF(DAY(OFFSET(INDIRECT(ADDRESS(ROW(),COLUMN())),0,-1))<15,BJ69+7,IF(DAY(OFFSET(INDIRECT(ADDRESS(ROW(),COLUMN())),0,-1))>21,BJ69-7,BJ69+0))","v":"2030-11-21"},null,"2030-06-18",{"$f":"IF(DAY(OFFSET(INDIRECT(ADDRESS(ROW(),COLUMN())),0,-1))<15,BM69+7,IF(DAY(OFFSET(INDIRECT(ADDRESS(ROW(),COLUMN())),0,-1))>21,BM69-7,BM69+0))","v":"2030-06-18"},null,"2030-05-28",{"$f":"IF(DAY(OFFSET(INDIRECT(ADDRESS(ROW(),COLUMN())),0,-1))<21,BP69+7,IF(DAY(OFFSET(INDIRECT(ADDRESS(ROW(),COLUMN())),0,-1))>28,BP69-7,BP69+0))","v":"2030-05-28"},null,null,{"$f":"IF(DAY(BT68)=DAY(21),BT68-6,BT68+1)","v":"2028-05-18"},null,"2030-06-18",{"$f":"IF(DAY(OFFSET(INDIRECT(ADDRESS(ROW(),COLUMN())),0,-1))<15,BV69+7,IF(DAY(OFFSET(INDIRECT(ADDRESS(ROW(),COLUMN())),0,-1))>21,BV69-7,BV69+0))","v":"2030-06-18"},null,"2029-03-20",{"$f":"IF(DAY(OFFSET(INDIRECT(ADDRESS(ROW(),COLUMN())),0,-1))>21,BY69+7,IF(DAY(OFFSET(INDIRECT(ADDRESS(ROW(),COLUMN())),0,-1))<7,BY69+0,IF(AND(DAY(OFFSET(INDIRECT(ADDRESS(ROW(),COLUMN())),0,-1))>7,DAY(OFFSET(INDIRECT(ADDRESS(ROW(),COLUMN())),0,-1))<15),BY69+7,BY69+0)))","v":"2029-03-20"},null,"2027-12-21",null,null,null,null,null,"2030-06-06",{"$f":"IF(DAY(OFFSET(INDIRECT(ADDRESS(ROW(),COLUMN())),0,-1))<7,CH69+0,IF(DAY(OFFSET(INDIRECT(ADDRESS(ROW(),COLUMN())),0,-1))>7,CH69-7,CH69+0))","v":"2030-06-06"},null,"2028-12-07",null,null,"2030-06-11",{"$f":"IF(DAY(OFFSET(INDIRECT(ADDRESS(ROW(),COLUMN())),0,-1))<8,CN69+7,CN69+0)","v":"2030-06-11"},null,"2030-06-03",{"$f":"IF(DAY(OFFSET(INDIRECT(ADDRESS(ROW(),COLUMN())),0,-1))<7,CQ69+0,IF(DAY(OFFSET(INDIRECT(ADDRESS(ROW(),COLUMN())),0,-1))>7,CQ69-7,CQ69+0))","v":"2030-06-03"},null,"2030-06-03",{"$f":"IF(DAY(OFFSET(INDIRECT(ADDRESS(ROW(),COLUMN())),0,-1))<7,CT69+0,IF(DAY(OFFSET(INDIRECT(ADDRESS(ROW(),COLUMN())),0,-1))>7,CT69-7,CT69+0))+3","v":"2030-06-06"},null,"2030-06-03",{"$f":"IF(DAY(OFFSET(INDIRECT(ADDRESS(ROW(),COLUMN())),0,-1))<8,CW69+7,CW69+0)","v":"2030-06-10"},null,"2030-06-17",{"$f":"IF(DAY(OFFSET(INDIRECT(ADDRESS(ROW(),COLUMN())),0,-1))<15,CZ69+7,IF(DAY(OFFSET(INDIRECT(ADDRESS(ROW(),COLUMN())),0,-1))>21,CZ69-7,CZ69+0))","v":"2030-06-17"}]
[null,null,null,null,null,"Div 12","Lincolnton",{"$f":"CG40","v":"2028-09-07"},"Lincolnton",21,7,0,null,"2029-04-02",{"$f":"IF(DAY(OFFSET(INDIRECT(ADDRESS(ROW(),COLUMN())),0,-1))>21,N70+7,IF(DAY(OFFSET(INDIRECT(ADDRESS(ROW(),COLUMN())),0,-1))<7,N70+0,IF(AND(DAY(OFFSET(INDIRECT(ADDRESS(ROW(),COLUMN())),0,-1))>7,DAY(OFFSET(INDIRECT(ADDRESS(ROW(),COLUMN())),0,-1))<15),N70+7,N70+0)))","v":"2029-04-02"},null,"2029-04-03",{"$f":"IF(DAY(OFFSET(INDIRECT(ADDRESS(ROW(),COLUMN())),0,-1))>21,Q70+7,IF(DAY(OFFSET(INDIRECT(ADDRESS(ROW(),COLUMN())),0,-1))<7,Q70+0,IF(AND(DAY(OFFSET(INDIRECT(ADDRESS(ROW(),COLUMN())),0,-1))>7,DAY(OFFSET(INDIRECT(ADDRESS(ROW(),COLUMN())),0,-1))<15),Q70+7,Q70+0)))","v":"2029-04-03"},null,"2030-07-09",{"$f":"IF(DAY(OFFSET(INDIRECT(ADDRESS(ROW(),COLUMN())),0,-1))<8,T70+7,T70+0)","v":"2030-07-09"},null,"2029-04-02",{"$f":"IF(DAY(OFFSET(INDIRECT(ADDRESS(ROW(),COLUMN())),0,-1))>21,W70+7,IF(DAY(OFFSET(INDIRECT(ADDRESS(ROW(),COLUMN())),0,-1))<7,W70+0,IF(AND(DAY(OFFSET(INDIRECT(ADDRESS(ROW(),COLUMN())),0,-1))>7,DAY(OFFSET(INDIRECT(ADDRESS(ROW(),COLUMN())),0,-1))<15),W70+7,W70+0)))","v":"2029-04-02"},null,"2030-07-11",{"$f":"IF(DAY(OFFSET(INDIRECT(ADDRESS(ROW(),COLUMN())),0,-1))=15,Z70-7,Z70+0)","v":"2030-07-11"},null,null,null,null,null,null,null,null,null,null,null,null,null,null,null,null,"2030-07-09",{"$f":"IF(DAY(OFFSET(INDIRECT(ADDRESS(ROW(),COLUMN())),0,-1))<8,AR70+7,AR70+0)","v":"2030-07-09"},null,"2029-04-02",{"$f":"IF(DAY(OFFSET(INDIRECT(ADDRESS(ROW(),COLUMN())),0,-1))>21,AU70+7,IF(DAY(OFFSET(INDIRECT(ADDRESS(ROW(),COLUMN())),0,-1))<7,AU70+0,IF(AND(DAY(OFFSET(INDIRECT(ADDRESS(ROW(),COLUMN())),0,-1))>7,DAY(OFFSET(INDIRECT(ADDRESS(ROW(),COLUMN())),0,-1))<15),AU70+7,AU70+0)))","v":"2029-04-02"},null,"2030-07-16",{"$f":"IF(DAY(OFFSET(INDIRECT(ADDRESS(ROW(),COLUMN())),0,-1))<16,AX70+7,AX70+0)","v":"2030-07-16"},null,"2029-04-05",{"$f":"IF(DAY(OFFSET(INDIRECT(ADDRESS(ROW(),COLUMN())),0,-1))>21,BA70+7,IF(DAY(OFFSET(INDIRECT(ADDRESS(ROW(),COLUMN())),0,-1))<7,BA70+0,IF(AND(DAY(OFFSET(INDIRECT(ADDRESS(ROW(),COLUMN())),0,-1))>7,DAY(OFFSET(INDIRECT(ADDRESS(ROW(),COLUMN())),0,-1))<15),BA70+7,BA70+0)))","v":"2029-04-05"},null,"2029-04-02",{"$f":"IF(DAY(OFFSET(INDIRECT(ADDRESS(ROW(),COLUMN())),0,-1))>21,BD70+7,IF(DAY(OFFSET(INDIRECT(ADDRESS(ROW(),COLUMN())),0,-1))<7,BD70+0,IF(AND(DAY(OFFSET(INDIRECT(ADDRESS(ROW(),COLUMN())),0,-1))>7,DAY(OFFSET(INDIRECT(ADDRESS(ROW(),COLUMN())),0,-1))<15),BD70+7,BD70+0)))","v":"2029-04-02"},null,"2029-04-03",null,null,"2030-12-19",{"$f":"IF(DAY(OFFSET(INDIRECT(ADDRESS(ROW(),COLUMN())),0,-1))<15,BJ70+7,IF(DAY(OFFSET(INDIRECT(ADDRESS(ROW(),COLUMN())),0,-1))>21,BJ70-7,BJ70+0))","v":"2030-12-19"},null,"2030-07-16",{"$f":"IF(DAY(OFFSET(INDIRECT(ADDRESS(ROW(),COLUMN())),0,-1))<15,BM70+7,IF(DAY(OFFSET(INDIRECT(ADDRESS(ROW(),COLUMN())),0,-1))>21,BM70-7,BM70+0))","v":"2030-07-16"},null,"2030-06-25",{"$f":"IF(DAY(OFFSET(INDIRECT(ADDRESS(ROW(),COLUMN())),0,-1))<21,BP70+7,IF(DAY(OFFSET(INDIRECT(ADDRESS(ROW(),COLUMN())),0,-1))>28,BP70-7,BP70+0))","v":"2030-06-25"},null,"2028-06-05",{"$f":"IF(DAY(OFFSET(INDIRECT(ADDRESS(ROW(),COLUMN())),0,-1))>21,BS70+7,IF(DAY(OFFSET(INDIRECT(ADDRESS(ROW(),COLUMN())),0,-1))<7,BS70+0,IF(AND(DAY(OFFSET(INDIRECT(ADDRESS(ROW(),COLUMN())),0,-1))>7,DAY(OFFSET(INDIRECT(ADDRESS(ROW(),COLUMN())),0,-1))<15),BS70+7,BS70+0)))","v":"2028-06-05"},null,"2030-07-16",{"$f":"IF(DAY(OFFSET(INDIRECT(ADDRESS(ROW(),COLUMN())),0,-1))<15,BV70+7,IF(DAY(OFFSET(INDIRECT(ADDRESS(ROW(),COLUMN())),0,-1))>21,BV70-7,BV70+0))","v":"2030-07-16"},null,"2029-04-03",{"$f":"IF(DAY(OFFSET(INDIRECT(ADDRESS(ROW(),COLUMN())),0,-1))>21,BY70+7,IF(DAY(OFFSET(INDIRECT(ADDRESS(ROW(),COLUMN())),0,-1))<7,BY70+0,IF(AND(DAY(OFFSET(INDIRECT(ADDRESS(ROW(),COLUMN())),0,-1))>7,DAY(OFFSET(INDIRECT(ADDRESS(ROW(),COLUMN())),0,-1))<15),BY70+7,BY70+0)))","v":"2029-04-03"},null,"2028-01-04",null,null,null,null,null,"2030-07-04",{"$f":"IF(DAY(OFFSET(INDIRECT(ADDRESS(ROW(),COLUMN())),0,-1))<7,CH70+0,IF(DAY(OFFSET(INDIRECT(ADDRESS(ROW(),COLUMN())),0,-1))>7,CH70-7,CH70+0))","v":"2030-07-04"},null,"2029-01-04",null,null,"2030-07-09",{"$f":"IF(DAY(OFFSET(INDIRECT(ADDRESS(ROW(),COLUMN())),0,-1))<8,CN70+7,CN70+0)","v":"2030-07-09"},null,"2030-07-08",{"$f":"IF(DAY(OFFSET(INDIRECT(ADDRESS(ROW(),COLUMN())),0,-1))<7,CQ70+0,IF(DAY(OFFSET(INDIRECT(ADDRESS(ROW(),COLUMN())),0,-1))>7,CQ70-7,CQ70+0))","v":"2030-07-01"},null,"2030-07-08",{"$f":"IF(DAY(OFFSET(INDIRECT(ADDRESS(ROW(),COLUMN())),0,-1))<7,CT70+0,IF(DAY(OFFSET(INDIRECT(ADDRESS(ROW(),COLUMN())),0,-1))>7,CT70-7,CT70+0))+3","v":"2030-07-04"},null,"2030-07-08",{"$f":"IF(DAY(OFFSET(INDIRECT(ADDRESS(ROW(),COLUMN())),0,-1))<8,CW70+7,CW70+0)","v":"2030-07-08"},null,"2030-07-22",{"$f":"IF(DAY(OFFSET(INDIRECT(ADDRESS(ROW(),COLUMN())),0,-1))<15,CZ70+7,IF(DAY(OFFSET(INDIRECT(ADDRESS(ROW(),COLUMN())),0,-1))>21,CZ70-7,CZ70+0))","v":"2030-07-15"}]
[null,null,null,null,null,"Div 11","Mount Airy",{"$f":"AZ40","v":"2028-08-17"},"Mount Airy",0,7,21,null,"2029-04-16",{"$f":"IF(DAY(OFFSET(INDIRECT(ADDRESS(ROW(),COLUMN())),0,-1))>21,N71+7,IF(DAY(OFFSET(INDIRECT(ADDRESS(ROW(),COLUMN())),0,-1))<7,N71+0,IF(AND(DAY(OFFSET(INDIRECT(ADDRESS(ROW(),COLUMN())),0,-1))>7,DAY(OFFSET(INDIRECT(ADDRESS(ROW(),COLUMN())),0,-1))<15),N71+7,N71+0)))","v":"2029-04-16"},null,"2029-04-17",{"$f":"IF(DAY(OFFSET(INDIRECT(ADDRESS(ROW(),COLUMN())),0,-1))>21,Q71+7,IF(DAY(OFFSET(INDIRECT(ADDRESS(ROW(),COLUMN())),0,-1))<7,Q71+0,IF(AND(DAY(OFFSET(INDIRECT(ADDRESS(ROW(),COLUMN())),0,-1))>7,DAY(OFFSET(INDIRECT(ADDRESS(ROW(),COLUMN())),0,-1))<15),Q71+7,Q71+0)))","v":"2029-04-17"},null,"2030-08-06",{"$f":"IF(DAY(OFFSET(INDIRECT(ADDRESS(ROW(),COLUMN())),0,-1))<8,T71+7,T71+0)","v":"2030-08-13"},null,"2029-04-16",{"$f":"IF(DAY(OFFSET(INDIRECT(ADDRESS(ROW(),COLUMN())),0,-1))>21,W71+7,IF(DAY(OFFSET(INDIRECT(ADDRESS(ROW(),COLUMN())),0,-1))<7,W71+0,IF(AND(DAY(OFFSET(INDIRECT(ADDRESS(ROW(),COLUMN())),0,-1))>7,DAY(OFFSET(INDIRECT(ADDRESS(ROW(),COLUMN())),0,-1))<15),W71+7,W71+0)))","v":"2029-04-16"},null,"2030-08-15",{"$f":"IF(DAY(OFFSET(INDIRECT(ADDRESS(ROW(),COLUMN())),0,-1))=15,Z71-7,Z71+0)","v":"2030-08-08"},null,null,null,null,null,null,null,null,null,null,null,null,null,null,null,null,"2030-08-06",{"$f":"IF(DAY(OFFSET(INDIRECT(ADDRESS(ROW(),COLUMN())),0,-1))<8,AR71+7,AR71+0)","v":"2030-08-13"},null,"2029-04-16",{"$f":"IF(DAY(OFFSET(INDIRECT(ADDRESS(ROW(),COLUMN())),0,-1))>21,AU71+7,IF(DAY(OFFSET(INDIRECT(ADDRESS(ROW(),COLUMN())),0,-1))<7,AU71+0,IF(AND(DAY(OFFSET(INDIRECT(ADDRESS(ROW(),COLUMN())),0,-1))>7,DAY(OFFSET(INDIRECT(ADDRESS(ROW(),COLUMN())),0,-1))<15),AU71+7,AU71+0)))","v":"2029-04-16"},null,"2030-08-20",{"$f":"IF(DAY(OFFSET(INDIRECT(ADDRESS(ROW(),COLUMN())),0,-1))<16,AX71+7,AX71+0)","v":"2030-08-20"},null,"2029-04-19",{"$f":"IF(DAY(OFFSET(INDIRECT(ADDRESS(ROW(),COLUMN())),0,-1))>21,BA71+7,IF(DAY(OFFSET(INDIRECT(ADDRESS(ROW(),COLUMN())),0,-1))<7,BA71+0,IF(AND(DAY(OFFSET(INDIRECT(ADDRESS(ROW(),COLUMN())),0,-1))>7,DAY(OFFSET(INDIRECT(ADDRESS(ROW(),COLUMN())),0,-1))<15),BA71+7,BA71+0)))","v":"2029-04-19"},null,"2029-04-17",{"$f":"IF(DAY(OFFSET(INDIRECT(ADDRESS(ROW(),COLUMN())),0,-1))>21,BD71+7,IF(DAY(OFFSET(INDIRECT(ADDRESS(ROW(),COLUMN())),0,-1))<7,BD71+0,IF(AND(DAY(OFFSET(INDIRECT(ADDRESS(ROW(),COLUMN())),0,-1))>7,DAY(OFFSET(INDIRECT(ADDRESS(ROW(),COLUMN())),0,-1))<15),BD71+7,BD71+0)))","v":"2029-04-17"},null,"2029-04-17",null,null,"2031-01-16",{"$f":"IF(DAY(OFFSET(INDIRECT(ADDRESS(ROW(),COLUMN())),0,-1))<15,BJ71+7,IF(DAY(OFFSET(INDIRECT(ADDRESS(ROW(),COLUMN())),0,-1))>21,BJ71-7,BJ71+0))","v":"2031-01-16"},null,"2030-08-20",{"$f":"IF(DAY(OFFSET(INDIRECT(ADDRESS(ROW(),COLUMN())),0,-1))<15,BM71+7,IF(DAY(OFFSET(INDIRECT(ADDRESS(ROW(),COLUMN())),0,-1))>21,BM71-7,BM71+0))","v":"2030-08-20"},null,"2030-07-23",{"$f":"IF(DAY(OFFSET(INDIRECT(ADDRESS(ROW(),COLUMN())),0,-1))<21,BP71+7,IF(DAY(OFFSET(INDIRECT(ADDRESS(ROW(),COLUMN())),0,-1))>28,BP71-7,BP71+0))","v":"2030-07-23"},null,"2028-06-19",{"$f":"IF((DAY(BS71))<DAY(13),BS71+10,IF((DAY(BS71))>=DAY(20),BS71-5,BS71+2))","v":"2028-06-21"},null,"2030-08-20",{"$f":"IF(DAY(OFFSET(INDIRECT(ADDRESS(ROW(),COLUMN())),0,-1))<15,BV71+7,IF(DAY(OFFSET(INDIRECT(ADDRESS(ROW(),COLUMN())),0,-1))>21,BV71-7,BV71+0))","v":"2030-08-20"},null,"2029-04-17",{"$f":"IF(DAY(OFFSET(INDIRECT(ADDRESS(ROW(),COLUMN())),0,-1))>21,BY71+7,IF(DAY(OFFSET(INDIRECT(ADDRESS(ROW(),COLUMN())),0,-1))<7,BY71+0,IF(AND(DAY(OFFSET(INDIRECT(ADDRESS(ROW(),COLUMN())),0,-1))>7,DAY(OFFSET(INDIRECT(ADDRESS(ROW(),COLUMN())),0,-1))<15),BY71+7,BY71+0)))","v":"2029-04-17"},null,"2028-01-18",null,null,null,null,null,"2030-08-08",{"$f":"IF(DAY(OFFSET(INDIRECT(ADDRESS(ROW(),COLUMN())),0,-1))<7,CH71+0,IF(DAY(OFFSET(INDIRECT(ADDRESS(ROW(),COLUMN())),0,-1))>7,CH71-7,CH71+0))","v":"2030-08-01"},null,"2029-02-08",null,null,"2030-08-06",{"$f":"IF(DAY(OFFSET(INDIRECT(ADDRESS(ROW(),COLUMN())),0,-1))<8,CN71+7,CN71+0)","v":"2030-08-13"},null,"2030-08-05",{"$f":"IF(DAY(OFFSET(INDIRECT(ADDRESS(ROW(),COLUMN())),0,-1))<7,CQ71+0,IF(DAY(OFFSET(INDIRECT(ADDRESS(ROW(),COLUMN())),0,-1))>7,CQ71-7,CQ71+0))","v":"2030-08-05"},null,"2030-08-05",{"$f":"IF(DAY(OFFSET(INDIRECT(ADDRESS(ROW(),COLUMN())),0,-1))<7,CT71+0,IF(DAY(OFFSET(INDIRECT(ADDRESS(ROW(),COLUMN())),0,-1))>7,CT71-7,CT71+0))+3","v":"2030-08-08"},null,"2030-08-05",{"$f":"IF(DAY(OFFSET(INDIRECT(ADDRESS(ROW(),COLUMN())),0,-1))<8,CW71+7,CW71+0)","v":"2030-08-12"},null,"2030-08-19",{"$f":"IF(DAY(OFFSET(INDIRECT(ADDRESS(ROW(),COLUMN())),0,-1))<15,CZ71+7,IF(DAY(OFFSET(INDIRECT(ADDRESS(ROW(),COLUMN())),0,-1))>21,CZ71-7,CZ71+0))","v":"2030-08-19"}]
[null,null,null,null,null,"Div 11","City of Lenor",{"$f":"P40","v":"2028-08-15"},"City of Lenor",0,7,0,null,"2029-04-30",{"$f":"IF(DAY(OFFSET(INDIRECT(ADDRESS(ROW(),COLUMN())),0,-1))>21,N72+7,IF(DAY(OFFSET(INDIRECT(ADDRESS(ROW(),COLUMN())),0,-1))<7,N72+0,IF(AND(DAY(OFFSET(INDIRECT(ADDRESS(ROW(),COLUMN())),0,-1))>7,DAY(OFFSET(INDIRECT(ADDRESS(ROW(),COLUMN())),0,-1))<15),N72+7,N72+0)))","v":"2029-05-07"},null,"2029-05-01",{"$f":"IF(DAY(OFFSET(INDIRECT(ADDRESS(ROW(),COLUMN())),0,-1))>21,Q72+7,IF(DAY(OFFSET(INDIRECT(ADDRESS(ROW(),COLUMN())),0,-1))<7,Q72+0,IF(AND(DAY(OFFSET(INDIRECT(ADDRESS(ROW(),COLUMN())),0,-1))>7,DAY(OFFSET(INDIRECT(ADDRESS(ROW(),COLUMN())),0,-1))<15),Q72+7,Q72+0)))","v":"2029-05-01"},null,"2030-09-10",{"$f":"IF(DAY(OFFSET(INDIRECT(ADDRESS(ROW(),COLUMN())),0,-1))<8,T72+7,T72+0)","v":"2030-09-10"},null,"2029-04-30",{"$f":"IF(DAY(OFFSET(INDIRECT(ADDRESS(ROW(),COLUMN())),0,-1))>21,W72+7,IF(DAY(OFFSET(INDIRECT(ADDRESS(ROW(),COLUMN())),0,-1))<7,W72+0,IF(AND(DAY(OFFSET(INDIRECT(ADDRESS(ROW(),COLUMN())),0,-1))>7,DAY(OFFSET(INDIRECT(ADDRESS(ROW(),COLUMN())),0,-1))<15),W72+7,W72+0)))","v":"2029-05-07"},null,"2030-09-12",{"$f":"IF(DAY(OFFSET(INDIRECT(ADDRESS(ROW(),COLUMN())),0,-1))=15,Z72-7,Z72+0)","v":"2030-09-12"},null,null,null,null,null,null,null,null,null,null,null,null,null,null,null,null,"2030-09-10",{"$f":"IF(DAY(OFFSET(INDIRECT(ADDRESS(ROW(),COLUMN())),0,-1))<8,AR72+7,AR72+0)","v":"2030-09-10"},null,"2029-04-30",{"$f":"IF(DAY(OFFSET(INDIRECT(ADDRESS(ROW(),COLUMN())),0,-1))>21,AU72+7,IF(DAY(OFFSET(INDIRECT(ADDRESS(ROW(),COLUMN())),0,-1))<7,AU72+0,IF(AND(DAY(OFFSET(INDIRECT(ADDRESS(ROW(),COLUMN())),0,-1))>7,DAY(OFFSET(INDIRECT(ADDRESS(ROW(),COLUMN())),0,-1))<15),AU72+7,AU72+0)))","v":"2029-05-07"},null,"2030-09-17",{"$f":"IF(DAY(OFFSET(INDIRECT(ADDRESS(ROW(),COLUMN())),0,-1))<16,AX72+7,AX72+0)","v":"2030-09-17"},null,"2029-05-03",{"$f":"IF(DAY(OFFSET(INDIRECT(ADDRESS(ROW(),COLUMN())),0,-1))>21,BA72+7,IF(DAY(OFFSET(INDIRECT(ADDRESS(ROW(),COLUMN())),0,-1))<7,BA72+0,IF(AND(DAY(OFFSET(INDIRECT(ADDRESS(ROW(),COLUMN())),0,-1))>7,DAY(OFFSET(INDIRECT(ADDRESS(ROW(),COLUMN())),0,-1))<15),BA72+7,BA72+0)))","v":"2029-05-03"},null,"2029-04-30",{"$f":"IF(DAY(OFFSET(INDIRECT(ADDRESS(ROW(),COLUMN())),0,-1))>21,BD72+7,IF(DAY(OFFSET(INDIRECT(ADDRESS(ROW(),COLUMN())),0,-1))<7,BD72+0,IF(AND(DAY(OFFSET(INDIRECT(ADDRESS(ROW(),COLUMN())),0,-1))>7,DAY(OFFSET(INDIRECT(ADDRESS(ROW(),COLUMN())),0,-1))<15),BD72+7,BD72+0)))","v":"2029-05-07"},null,"2029-05-01",null,null,"2028-09-21",{"$f":"IF(DAY(OFFSET(INDIRECT(ADDRESS(ROW(),COLUMN())),0,-1))<15,BJ72+7,IF(DAY(OFFSET(INDIRECT(ADDRESS(ROW(),COLUMN())),0,-1))>21,BJ72-7,BJ72+0))","v":"2028-09-21"},null,"2030-09-17",{"$f":"IF(DAY(OFFSET(INDIRECT(ADDRESS(ROW(),COLUMN())),0,-1))<15,BM72+7,IF(DAY(OFFSET(INDIRECT(ADDRESS(ROW(),COLUMN())),0,-1))>21,BM72-7,BM72+0))","v":"2030-09-17"},null,"2030-08-27",{"$f":"IF(DAY(OFFSET(INDIRECT(ADDRESS(ROW(),COLUMN())),0,-1))<21,BP72+7,IF(DAY(OFFSET(INDIRECT(ADDRESS(ROW(),COLUMN())),0,-1))>28,BP72-7,BP72+0))","v":"2030-08-27"},null,null,{"$f":"IF(DAY(BT71)=DAY(21),BT71-6,BT71+1)","v":"2028-06-15"},null,"2030-09-17",{"$f":"IF(DAY(OFFSET(INDIRECT(ADDRESS(ROW(),COLUMN())),0,-1))<15,BV72+7,IF(DAY(OFFSET(INDIRECT(ADDRESS(ROW(),COLUMN())),0,-1))>21,BV72-7,BV72+0))","v":"2030-09-17"},null,"2029-05-01",{"$f":"IF(DAY(OFFSET(INDIRECT(ADDRESS(ROW(),COLUMN())),0,-1))>21,BY72+7,IF(DAY(OFFSET(INDIRECT(ADDRESS(ROW(),COLUMN())),0,-1))<7,BY72+0,IF(AND(DAY(OFFSET(INDIRECT(ADDRESS(ROW(),COLUMN())),0,-1))>7,DAY(OFFSET(INDIRECT(ADDRESS(ROW(),COLUMN())),0,-1))<15),BY72+7,BY72+0)))","v":"2029-05-01"},null,"2028-02-01",null,null,null,null,null,"2030-09-05",{"$f":"IF(DAY(OFFSET(INDIRECT(ADDRESS(ROW(),COLUMN())),0,-1))<7,CH72+0,IF(DAY(OFFSET(INDIRECT(ADDRESS(ROW(),COLUMN())),0,-1))>7,CH72-7,CH72+0))","v":"2030-09-05"},null,"2029-03-08",null,null,"2030-09-10",{"$f":"IF(DAY(OFFSET(INDIRECT(ADDRESS(ROW(),COLUMN())),0,-1))<8,CN72+7,CN72+0)","v":"2030-09-10"},null,"2030-09-02",{"$f":"IF(DAY(OFFSET(INDIRECT(ADDRESS(ROW(),COLUMN())),0,-1))<7,CQ72+0,IF(DAY(OFFSET(INDIRECT(ADDRESS(ROW(),COLUMN())),0,-1))>7,CQ72-7,CQ72+0))","v":"2030-09-02"},null,"2030-09-02",{"$f":"IF(DAY(OFFSET(INDIRECT(ADDRESS(ROW(),COLUMN())),0,-1))<7,CT72+0,IF(DAY(OFFSET(INDIRECT(ADDRESS(ROW(),COLUMN())),0,-1))>7,CT72-7,CT72+0))+3","v":"2030-09-05"},null,"2030-09-02",{"$f":"IF(DAY(OFFSET(INDIRECT(ADDRESS(ROW(),COLUMN())),0,-1))<8,CW72+7,CW72+0)","v":"2030-09-09"},null,"2030-09-16",{"$f":"IF(DAY(OFFSET(INDIRECT(ADDRESS(ROW(),COLUMN())),0,-1))<15,CZ72+7,IF(DAY(OFFSET(INDIRECT(ADDRESS(ROW(),COLUMN())),0,-1))>21,CZ72-7,CZ72+0))","v":"2030-09-16"}]
[null,null,null,null,null,"Div 11","Town of Boone",{"$f":"P40","v":"2028-08-15"},"Town of Boone",0,7,60,null,"2029-05-14",{"$f":"IF(DAY(OFFSET(INDIRECT(ADDRESS(ROW(),COLUMN())),0,-1))>21,N73+7,IF(DAY(OFFSET(INDIRECT(ADDRESS(ROW(),COLUMN())),0,-1))<7,N73+0,IF(AND(DAY(OFFSET(INDIRECT(ADDRESS(ROW(),COLUMN())),0,-1))>7,DAY(OFFSET(INDIRECT(ADDRESS(ROW(),COLUMN())),0,-1))<15),N73+7,N73+0)))","v":"2029-05-21"},null,"2029-05-15",{"$f":"IF(DAY(OFFSET(INDIRECT(ADDRESS(ROW(),COLUMN())),0,-1))>21,Q73+7,IF(DAY(OFFSET(INDIRECT(ADDRESS(ROW(),COLUMN())),0,-1))<7,Q73+0,IF(AND(DAY(OFFSET(INDIRECT(ADDRESS(ROW(),COLUMN())),0,-1))>7,DAY(OFFSET(INDIRECT(ADDRESS(ROW(),COLUMN())),0,-1))<15),Q73+7,Q73+0)))","v":"2029-05-15"},null,"2030-10-08",{"$f":"IF(DAY(OFFSET(INDIRECT(ADDRESS(ROW(),COLUMN())),0,-1))<8,T73+7,T73+0)","v":"2030-10-08"},null,"2029-05-14",{"$f":"IF(DAY(OFFSET(INDIRECT(ADDRESS(ROW(),COLUMN())),0,-1))>21,W73+7,IF(DAY(OFFSET(INDIRECT(ADDRESS(ROW(),COLUMN())),0,-1))<7,W73+0,IF(AND(DAY(OFFSET(INDIRECT(ADDRESS(ROW(),COLUMN())),0,-1))>7,DAY(OFFSET(INDIRECT(ADDRESS(ROW(),COLUMN())),0,-1))<15),W73+7,W73+0)))","v":"2029-05-21"},null,"2030-10-10",null,null,null,null,null,null,null,null,null,null,null,null,null,null,null,null,null,"2030-10-08",{"$f":"IF(DAY(OFFSET(INDIRECT(ADDRESS(ROW(),COLUMN())),0,-1))<8,AR73+7,AR73+0)","v":"2030-10-08"},null,"2029-05-14",{"$f":"IF(DAY(OFFSET(INDIRECT(ADDRESS(ROW(),COLUMN())),0,-1))>21,AU73+7,IF(DAY(OFFSET(INDIRECT(ADDRESS(ROW(),COLUMN())),0,-1))<7,AU73+0,IF(AND(DAY(OFFSET(INDIRECT(ADDRESS(ROW(),COLUMN())),0,-1))>7,DAY(OFFSET(INDIRECT(ADDRESS(ROW(),COLUMN())),0,-1))<15),AU73+7,AU73+0)))","v":"2029-05-21"},null,"2030-10-15",{"$f":"IF(DAY(OFFSET(INDIRECT(ADDRESS(ROW(),COLUMN())),0,-1))<16,AX73+7,AX73+0)","v":"2030-10-22"},null,"2029-05-17",{"$f":"IF(DAY(OFFSET(INDIRECT(ADDRESS(ROW(),COLUMN())),0,-1))>21,BA73+7,IF(DAY(OFFSET(INDIRECT(ADDRESS(ROW(),COLUMN())),0,-1))<7,BA73+0,IF(AND(DAY(OFFSET(INDIRECT(ADDRESS(ROW(),COLUMN())),0,-1))>7,DAY(OFFSET(INDIRECT(ADDRESS(ROW(),COLUMN())),0,-1))<15),BA73+7,BA73+0)))","v":"2029-05-17"},null,"2029-05-15",{"$f":"IF(DAY(OFFSET(INDIRECT(ADDRESS(ROW(),COLUMN())),0,-1))>21,BD73+7,IF(DAY(OFFSET(INDIRECT(ADDRESS(ROW(),COLUMN())),0,-1))<7,BD73+0,IF(AND(DAY(OFFSET(INDIRECT(ADDRESS(ROW(),COLUMN())),0,-1))>7,DAY(OFFSET(INDIRECT(ADDRESS(ROW(),COLUMN())),0,-1))<15),BD73+7,BD73+0)))","v":"2029-05-15"},null,"2029-05-15",null,null,"2028-10-19",null,null,"2030-10-22",{"$f":"IF(DAY(OFFSET(INDIRECT(ADDRESS(ROW(),COLUMN())),0,-1))<15,BM73+7,IF(DAY(OFFSET(INDIRECT(ADDRESS(ROW(),COLUMN())),0,-1))>21,BM73-7,BM73+0))","v":"2030-10-15"},null,"2030-09-24",{"$f":"IF(DAY(OFFSET(INDIRECT(ADDRESS(ROW(),COLUMN())),0,-1))<21,BP73+7,IF(DAY(OFFSET(INDIRECT(ADDRESS(ROW(),COLUMN())),0,-1))>28,BP73-7,BP73+0))","v":"2030-09-24"},null,"2028-07-03",{"$f":"IF(DAY(OFFSET(INDIRECT(ADDRESS(ROW(),COLUMN())),0,-1))>21,BS73+7,IF(DAY(OFFSET(INDIRECT(ADDRESS(ROW(),COLUMN())),0,-1))<7,BS73+0,IF(AND(DAY(OFFSET(INDIRECT(ADDRESS(ROW(),COLUMN())),0,-1))>7,DAY(OFFSET(INDIRECT(ADDRESS(ROW(),COLUMN())),0,-1))<15),BS73+7,BS73+0)))","v":"2028-07-03"},null,"2030-10-22",{"$f":"IF(DAY(OFFSET(INDIRECT(ADDRESS(ROW(),COLUMN())),0,-1))<15,BV73+7,IF(DAY(OFFSET(INDIRECT(ADDRESS(ROW(),COLUMN())),0,-1))>21,BV73-7,BV73+0))","v":"2030-10-15"},null,"2029-05-15",{"$f":"IF(DAY(OFFSET(INDIRECT(ADDRESS(ROW(),COLUMN())),0,-1))>21,BY73+7,IF(DAY(OFFSET(INDIRECT(ADDRESS(ROW(),COLUMN())),0,-1))<7,BY73+0,IF(AND(DAY(OFFSET(INDIRECT(ADDRESS(ROW(),COLUMN())),0,-1))>7,DAY(OFFSET(INDIRECT(ADDRESS(ROW(),COLUMN())),0,-1))<15),BY73+7,BY73+0)))","v":"2029-05-15"},null,"2028-02-15",null,null,null,null,null,"2030-10-03",{"$f":"IF(DAY(OFFSET(INDIRECT(ADDRESS(ROW(),COLUMN())),0,-1))<7,CH73+0,IF(DAY(OFFSET(INDIRECT(ADDRESS(ROW(),COLUMN())),0,-1))>7,CH73-7,CH73+0))","v":"2030-10-03"},null,"2029-04-05",null,null,"2030-10-08",{"$f":"IF(DAY(OFFSET(INDIRECT(ADDRESS(ROW(),COLUMN())),0,-1))<8,CN73+7,CN73+0)","v":"2030-10-08"},null,"2030-10-07",{"$f":"IF(DAY(OFFSET(INDIRECT(ADDRESS(ROW(),COLUMN())),0,-1))<7,CQ73+0,IF(DAY(OFFSET(INDIRECT(ADDRESS(ROW(),COLUMN())),0,-1))>7,CQ73-7,CQ73+0))","v":"2030-10-07"},null,"2030-10-07",{"$f":"IF(DAY(OFFSET(INDIRECT(ADDRESS(ROW(),COLUMN())),0,-1))<7,CT73+0,IF(DAY(OFFSET(INDIRECT(ADDRESS(ROW(),COLUMN())),0,-1))>7,CT73-7,CT73+0))+3","v":"2030-10-10"},null,"2030-10-07",{"$f":"IF(DAY(OFFSET(INDIRECT(ADDRESS(ROW(),COLUMN())),0,-1))<8,CW73+7,CW73+0)","v":"2030-10-14"},null,"2030-10-21",{"$f":"IF(DAY(OFFSET(INDIRECT(ADDRESS(ROW(),COLUMN())),0,-1))<15,CZ73+7,IF(DAY(OFFSET(INDIRECT(ADDRESS(ROW(),COLUMN())),0,-1))>21,CZ73-7,CZ73+0))","v":"2030-10-21"}]
[null,null,null,null,null,"Div 9","Winston-Salem",{"$f":"CV40","v":"2028-07-10"},"Winston-Salem",30,60,30,null,"2029-06-04",{"$f":"IF(DAY(OFFSET(INDIRECT(ADDRESS(ROW(),COLUMN())),0,-1))>21,N74+7,IF(DAY(OFFSET(INDIRECT(ADDRESS(ROW(),COLUMN())),0,-1))<7,N74+0,IF(AND(DAY(OFFSET(INDIRECT(ADDRESS(ROW(),COLUMN())),0,-1))>7,DAY(OFFSET(INDIRECT(ADDRESS(ROW(),COLUMN())),0,-1))<15),N74+7,N74+0)))","v":"2029-06-04"},null,"2029-06-05",{"$f":"IF(DAY(OFFSET(INDIRECT(ADDRESS(ROW(),COLUMN())),0,-1))>21,Q74+7,IF(DAY(OFFSET(INDIRECT(ADDRESS(ROW(),COLUMN())),0,-1))<7,Q74+0,IF(AND(DAY(OFFSET(INDIRECT(ADDRESS(ROW(),COLUMN())),0,-1))>7,DAY(OFFSET(INDIRECT(ADDRESS(ROW(),COLUMN())),0,-1))<15),Q74+7,Q74+0)))","v":"2029-06-05"},null,"2030-11-12",{"$f":"IF(DAY(OFFSET(INDIRECT(ADDRESS(ROW(),COLUMN())),0,-1))<8,T74+7,T74+0)","v":"2030-11-12"},null,"2029-06-04",{"$f":"IF(DAY(OFFSET(INDIRECT(ADDRESS(ROW(),COLUMN())),0,-1))>21,W74+7,IF(DAY(OFFSET(INDIRECT(ADDRESS(ROW(),COLUMN())),0,-1))<7,W74+0,IF(AND(DAY(OFFSET(INDIRECT(ADDRESS(ROW(),COLUMN())),0,-1))>7,DAY(OFFSET(INDIRECT(ADDRESS(ROW(),COLUMN())),0,-1))<15),W74+7,W74+0)))","v":"2029-06-04"},null,"2030-11-14",null,null,null,null,null,null,null,null,null,null,null,null,null,null,null,null,null,"2030-11-12",{"$f":"IF(DAY(OFFSET(INDIRECT(ADDRESS(ROW(),COLUMN())),0,-1))<8,AR74+7,AR74+0)","v":"2030-11-12"},null,"2029-06-04",{"$f":"IF(DAY(OFFSET(INDIRECT(ADDRESS(ROW(),COLUMN())),0,-1))>21,AU74+7,IF(DAY(OFFSET(INDIRECT(ADDRESS(ROW(),COLUMN())),0,-1))<7,AU74+0,IF(AND(DAY(OFFSET(INDIRECT(ADDRESS(ROW(),COLUMN())),0,-1))>7,DAY(OFFSET(INDIRECT(ADDRESS(ROW(),COLUMN())),0,-1))<15),AU74+7,AU74+0)))","v":"2029-06-04"},null,"2030-11-19",{"$f":"IF(DAY(OFFSET(INDIRECT(ADDRESS(ROW(),COLUMN())),0,-1))<16,AX74+7,AX74+0)","v":"2030-11-19"},null,"2029-05-31",{"$f":"IF(DAY(OFFSET(INDIRECT(ADDRESS(ROW(),COLUMN())),0,-1))>21,BA74+7,IF(DAY(OFFSET(INDIRECT(ADDRESS(ROW(),COLUMN())),0,-1))<7,BA74+0,IF(AND(DAY(OFFSET(INDIRECT(ADDRESS(ROW(),COLUMN())),0,-1))>7,DAY(OFFSET(INDIRECT(ADDRESS(ROW(),COLUMN())),0,-1))<15),BA74+7,BA74+0)))","v":"2029-06-07"},null,"2029-06-04",{"$f":"IF(DAY(OFFSET(INDIRECT(ADDRESS(ROW(),COLUMN())),0,-1))>21,BD74+7,IF(DAY(OFFSET(INDIRECT(ADDRESS(ROW(),COLUMN())),0,-1))<7,BD74+0,IF(AND(DAY(OFFSET(INDIRECT(ADDRESS(ROW(),COLUMN())),0,-1))>7,DAY(OFFSET(INDIRECT(ADDRESS(ROW(),COLUMN())),0,-1))<15),BD74+7,BD74+0)))","v":"2029-06-04"},null,"2029-06-05",null,null,"2028-11-16",null,null,"2030-11-19",{"$f":"IF(DAY(OFFSET(INDIRECT(ADDRESS(ROW(),COLUMN())),0,-1))<15,BM74+7,IF(DAY(OFFSET(INDIRECT(ADDRESS(ROW(),COLUMN())),0,-1))>21,BM74-7,BM74+0))","v":"2030-11-19"},null,"2030-10-29",{"$f":"IF(DAY(OFFSET(INDIRECT(ADDRESS(ROW(),COLUMN())),0,-1))<21,BP74+7,IF(DAY(OFFSET(INDIRECT(ADDRESS(ROW(),COLUMN())),0,-1))>28,BP74-7,BP74+0))","v":"2030-10-22"},null,"2028-07-17",{"$f":"IF((DAY(BS74))<DAY(13),BS74+10,IF((DAY(BS74))>=DAY(20),BS74-5,BS74+2))","v":"2028-07-19"},null,"2030-11-19",{"$f":"IF(DAY(OFFSET(INDIRECT(ADDRESS(ROW(),COLUMN())),0,-1))<15,BV74+7,IF(DAY(OFFSET(INDIRECT(ADDRESS(ROW(),COLUMN())),0,-1))>21,BV74-7,BV74+0))","v":"2030-11-19"},null,"2029-06-05",{"$f":"IF(DAY(OFFSET(INDIRECT(ADDRESS(ROW(),COLUMN())),0,-1))>21,BY74+7,IF(DAY(OFFSET(INDIRECT(ADDRESS(ROW(),COLUMN())),0,-1))<7,BY74+0,IF(AND(DAY(OFFSET(INDIRECT(ADDRESS(ROW(),COLUMN())),0,-1))>7,DAY(OFFSET(INDIRECT(ADDRESS(ROW(),COLUMN())),0,-1))<15),BY74+7,BY74+0)))","v":"2029-06-05"},null,"2028-03-07",null,null,null,null,null,"2030-11-07",{"$f":"IF(DAY(OFFSET(INDIRECT(ADDRESS(ROW(),COLUMN())),0,-1))<7,CH74+0,IF(DAY(OFFSET(INDIRECT(ADDRESS(ROW(),COLUMN())),0,-1))>7,CH74-7,CH74+0))","v":"2030-11-07"},null,"2029-05-03",null,null,"2030-11-12",{"$f":"IF(DAY(OFFSET(INDIRECT(ADDRESS(ROW(),COLUMN())),0,-1))<8,CN74+7,CN74+0)","v":"2030-11-12"},null,"2030-11-04",{"$f":"IF(DAY(OFFSET(INDIRECT(ADDRESS(ROW(),COLUMN())),0,-1))<7,CQ74+0,IF(DAY(OFFSET(INDIRECT(ADDRESS(ROW(),COLUMN())),0,-1))>7,CQ74-7,CQ74+0))","v":"2030-11-04"},null,"2030-11-04",{"$f":"IF(DAY(OFFSET(INDIRECT(ADDRESS(ROW(),COLUMN())),0,-1))<7,CT74+0,IF(DAY(OFFSET(INDIRECT(ADDRESS(ROW(),COLUMN())),0,-1))>7,CT74-7,CT74+0))+3","v":"2030-11-07"},null,"2030-11-04",{"$f":"IF(DAY(OFFSET(INDIRECT(ADDRESS(ROW(),COLUMN())),0,-1))<8,CW74+7,CW74+0)","v":"2030-11-11"},null,"2030-11-18",{"$f":"IF(DAY(OFFSET(INDIRECT(ADDRESS(ROW(),COLUMN())),0,-1))<15,CZ74+7,IF(DAY(OFFSET(INDIRECT(ADDRESS(ROW(),COLUMN())),0,-1))>21,CZ74-7,CZ74+0))","v":"2030-11-18"}]
[null,null,null,null,null,"Div 9","City of Kannapolis",{"$f":"M40","v":"2028-08-21"},"City of Kannapolis",0,7,0,null,"2029-06-18",{"$f":"IF(DAY(OFFSET(INDIRECT(ADDRESS(ROW(),COLUMN())),0,-1))>21,N75+7,IF(DAY(OFFSET(INDIRECT(ADDRESS(ROW(),COLUMN())),0,-1))<7,N75+0,IF(AND(DAY(OFFSET(INDIRECT(ADDRESS(ROW(),COLUMN())),0,-1))>7,DAY(OFFSET(INDIRECT(ADDRESS(ROW(),COLUMN())),0,-1))<15),N75+7,N75+0)))","v":"2029-06-18"},null,"2029-06-19",{"$f":"IF(DAY(OFFSET(INDIRECT(ADDRESS(ROW(),COLUMN())),0,-1))>21,Q75+7,IF(DAY(OFFSET(INDIRECT(ADDRESS(ROW(),COLUMN())),0,-1))<7,Q75+0,IF(AND(DAY(OFFSET(INDIRECT(ADDRESS(ROW(),COLUMN())),0,-1))>7,DAY(OFFSET(INDIRECT(ADDRESS(ROW(),COLUMN())),0,-1))<15),Q75+7,Q75+0)))","v":"2029-06-19"},null,"2030-12-10",{"$f":"IF(DAY(OFFSET(INDIRECT(ADDRESS(ROW(),COLUMN())),0,-1))<8,T75+7,T75+0)","v":"2030-12-10"},null,"2029-06-18",{"$f":"IF(DAY(OFFSET(INDIRECT(ADDRESS(ROW(),COLUMN())),0,-1))>21,W75+7,IF(DAY(OFFSET(INDIRECT(ADDRESS(ROW(),COLUMN())),0,-1))<7,W75+0,IF(AND(DAY(OFFSET(INDIRECT(ADDRESS(ROW(),COLUMN())),0,-1))>7,DAY(OFFSET(INDIRECT(ADDRESS(ROW(),COLUMN())),0,-1))<15),W75+7,W75+0)))","v":"2029-06-18"},null,"2030-12-12",null,null,null,null,null,null,null,null,null,null,null,null,null,null,null,null,null,"2030-12-10",{"$f":"IF(DAY(OFFSET(INDIRECT(ADDRESS(ROW(),COLUMN())),0,-1))<8,AR75+7,AR75+0)","v":"2030-12-10"},null,"2029-06-18",{"$f":"IF(DAY(OFFSET(INDIRECT(ADDRESS(ROW(),COLUMN())),0,-1))>21,AU75+7,IF(DAY(OFFSET(INDIRECT(ADDRESS(ROW(),COLUMN())),0,-1))<7,AU75+0,IF(AND(DAY(OFFSET(INDIRECT(ADDRESS(ROW(),COLUMN())),0,-1))>7,DAY(OFFSET(INDIRECT(ADDRESS(ROW(),COLUMN())),0,-1))<15),AU75+7,AU75+0)))","v":"2029-06-18"},null,"2030-12-17",{"$f":"IF(DAY(OFFSET(INDIRECT(ADDRESS(ROW(),COLUMN())),0,-1))<16,AX75+7,AX75+0)","v":"2030-12-17"},null,"2029-06-14",{"$f":"IF(DAY(OFFSET(INDIRECT(ADDRESS(ROW(),COLUMN())),0,-1))>21,BA75+7,IF(DAY(OFFSET(INDIRECT(ADDRESS(ROW(),COLUMN())),0,-1))<7,BA75+0,IF(AND(DAY(OFFSET(INDIRECT(ADDRESS(ROW(),COLUMN())),0,-1))>7,DAY(OFFSET(INDIRECT(ADDRESS(ROW(),COLUMN())),0,-1))<15),BA75+7,BA75+0)))","v":"2029-06-21"},null,"2029-06-19",{"$f":"IF(DAY(OFFSET(INDIRECT(ADDRESS(ROW(),COLUMN())),0,-1))>21,BD75+7,IF(DAY(OFFSET(INDIRECT(ADDRESS(ROW(),COLUMN())),0,-1))<7,BD75+0,IF(AND(DAY(OFFSET(INDIRECT(ADDRESS(ROW(),COLUMN())),0,-1))>7,DAY(OFFSET(INDIRECT(ADDRESS(ROW(),COLUMN())),0,-1))<15),BD75+7,BD75+0)))","v":"2029-06-19"},null,"2029-06-19",null,null,"2028-12-21",null,null,"2030-12-17",{"$f":"IF(DAY(OFFSET(INDIRECT(ADDRESS(ROW(),COLUMN())),0,-1))<15,BM75+7,IF(DAY(OFFSET(INDIRECT(ADDRESS(ROW(),COLUMN())),0,-1))>21,BM75-7,BM75+0))","v":"2030-12-17"},null,"2030-11-26",{"$f":"IF(DAY(OFFSET(INDIRECT(ADDRESS(ROW(),COLUMN())),0,-1))<21,BP75+7,IF(DAY(OFFSET(INDIRECT(ADDRESS(ROW(),COLUMN())),0,-1))>28,BP75-7,BP75+0))","v":"2030-11-26"},null,null,{"$f":"IF(DAY(BT74)=DAY(21),BT74-6,BT74+1)","v":"2028-07-20"},null,"2030-12-17",{"$f":"IF(DAY(OFFSET(INDIRECT(ADDRESS(ROW(),COLUMN())),0,-1))<15,BV75+7,IF(DAY(OFFSET(INDIRECT(ADDRESS(ROW(),COLUMN())),0,-1))>21,BV75-7,BV75+0))","v":"2030-12-17"},null,"2029-06-19",{"$f":"IF(DAY(OFFSET(INDIRECT(ADDRESS(ROW(),COLUMN())),0,-1))>21,BY75+7,IF(DAY(OFFSET(INDIRECT(ADDRESS(ROW(),COLUMN())),0,-1))<7,BY75+0,IF(AND(DAY(OFFSET(INDIRECT(ADDRESS(ROW(),COLUMN())),0,-1))>7,DAY(OFFSET(INDIRECT(ADDRESS(ROW(),COLUMN())),0,-1))<15),BY75+7,BY75+0)))","v":"2029-06-19"},null,"2028-03-21",null,null,null,null,null,"2030-12-05",{"$f":"IF(DAY(OFFSET(INDIRECT(ADDRESS(ROW(),COLUMN())),0,-1))<7,CH75+0,IF(DAY(OFFSET(INDIRECT(ADDRESS(ROW(),COLUMN())),0,-1))>7,CH75-7,CH75+0))","v":"2030-12-05"},null,"2029-06-07",null,null,"2030-12-10",{"$f":"IF(DAY(OFFSET(INDIRECT(ADDRESS(ROW(),COLUMN())),0,-1))<8,CN75+7,CN75+0)","v":"2030-12-10"},null,"2030-12-02",{"$f":"IF(DAY(OFFSET(INDIRECT(ADDRESS(ROW(),COLUMN())),0,-1))<7,CQ75+0,IF(DAY(OFFSET(INDIRECT(ADDRESS(ROW(),COLUMN())),0,-1))>7,CQ75-7,CQ75+0))","v":"2030-12-02"},null,"2030-12-02",{"$f":"IF(DAY(OFFSET(INDIRECT(ADDRESS(ROW(),COLUMN())),0,-1))<7,CT75+0,IF(DAY(OFFSET(INDIRECT(ADDRESS(ROW(),COLUMN())),0,-1))>7,CT75-7,CT75+0))+3","v":"2030-12-05"},null,"2030-12-02",{"$f":"IF(DAY(OFFSET(INDIRECT(ADDRESS(ROW(),COLUMN())),0,-1))<8,CW75+7,CW75+0)","v":"2030-12-09"},null,"2030-12-16",{"$f":"IF(DAY(OFFSET(INDIRECT(ADDRESS(ROW(),COLUMN())),0,-1))<15,CZ75+7,IF(DAY(OFFSET(INDIRECT(ADDRESS(ROW(),COLUMN())),0,-1))>21,CZ75-7,CZ75+0))","v":"2030-12-16"}]
[null,null,null,null,null,"Div 9","City of Salisbury",{"$f":"P40","v":"2028-08-15"},"City of Salisbury",0,7,60,null,"2029-07-02",{"$f":"IF(DAY(OFFSET(INDIRECT(ADDRESS(ROW(),COLUMN())),0,-1))>21,N76+7,IF(DAY(OFFSET(INDIRECT(ADDRESS(ROW(),COLUMN())),0,-1))<7,N76+0,IF(AND(DAY(OFFSET(INDIRECT(ADDRESS(ROW(),COLUMN())),0,-1))>7,DAY(OFFSET(INDIRECT(ADDRESS(ROW(),COLUMN())),0,-1))<15),N76+7,N76+0)))","v":"2029-07-02"},null,"2029-07-03",{"$f":"IF(DAY(OFFSET(INDIRECT(ADDRESS(ROW(),COLUMN())),0,-1))>21,Q76+7,IF(DAY(OFFSET(INDIRECT(ADDRESS(ROW(),COLUMN())),0,-1))<7,Q76+0,IF(AND(DAY(OFFSET(INDIRECT(ADDRESS(ROW(),COLUMN())),0,-1))>7,DAY(OFFSET(INDIRECT(ADDRESS(ROW(),COLUMN())),0,-1))<15),Q76+7,Q76+0)))","v":"2029-07-03"},null,"2031-01-07",{"$f":"IF(DAY(OFFSET(INDIRECT(ADDRESS(ROW(),COLUMN())),0,-1))<8,T76+7,T76+0)","v":"2031-01-14"},null,"2029-07-02",{"$f":"IF(DAY(OFFSET(INDIRECT(ADDRESS(ROW(),COLUMN())),0,-1))>21,W76+7,IF(DAY(OFFSET(INDIRECT(ADDRESS(ROW(),COLUMN())),0,-1))<7,W76+0,IF(AND(DAY(OFFSET(INDIRECT(ADDRESS(ROW(),COLUMN())),0,-1))>7,DAY(OFFSET(INDIRECT(ADDRESS(ROW(),COLUMN())),0,-1))<15),W76+7,W76+0)))","v":"2029-07-02"},null,"2031-01-09",null,null,null,null,null,null,null,null,null,null,null,null,null,null,null,null,null,"2031-01-07",{"$f":"IF(DAY(OFFSET(INDIRECT(ADDRESS(ROW(),COLUMN())),0,-1))<8,AR76+7,AR76+0)","v":"2031-01-14"},null,"2029-07-02",{"$f":"IF(DAY(OFFSET(INDIRECT(ADDRESS(ROW(),COLUMN())),0,-1))>21,AU76+7,IF(DAY(OFFSET(INDIRECT(ADDRESS(ROW(),COLUMN())),0,-1))<7,AU76+0,IF(AND(DAY(OFFSET(INDIRECT(ADDRESS(ROW(),COLUMN())),0,-1))>7,DAY(OFFSET(INDIRECT(ADDRESS(ROW(),COLUMN())),0,-1))<15),AU76+7,AU76+0)))","v":"2029-07-02"},null,"2031-01-21",{"$f":"IF(DAY(OFFSET(INDIRECT(ADDRESS(ROW(),COLUMN())),0,-1))<16,AX76+7,AX76+0)","v":"2031-01-21"},null,"2029-07-05",{"$f":"IF(DAY(OFFSET(INDIRECT(ADDRESS(ROW(),COLUMN())),0,-1))>21,BA76+7,IF(DAY(OFFSET(INDIRECT(ADDRESS(ROW(),COLUMN())),0,-1))<7,BA76+0,IF(AND(DAY(OFFSET(INDIRECT(ADDRESS(ROW(),COLUMN())),0,-1))>7,DAY(OFFSET(INDIRECT(ADDRESS(ROW(),COLUMN())),0,-1))<15),BA76+7,BA76+0)))","v":"2029-07-05"},null,"2029-07-02",{"$f":"IF(DAY(OFFSET(INDIRECT(ADDRESS(ROW(),COLUMN())),0,-1))>21,BD76+7,IF(DAY(OFFSET(INDIRECT(ADDRESS(ROW(),COLUMN())),0,-1))<7,BD76+0,IF(AND(DAY(OFFSET(INDIRECT(ADDRESS(ROW(),COLUMN())),0,-1))>7,DAY(OFFSET(INDIRECT(ADDRESS(ROW(),COLUMN())),0,-1))<15),BD76+7,BD76+0)))","v":"2029-07-02"},null,"2029-07-03",null,null,"2029-01-18",null,null,"2031-01-21",{"$f":"IF(DAY(OFFSET(INDIRECT(ADDRESS(ROW(),COLUMN())),0,-1))<15,BM76+7,IF(DAY(OFFSET(INDIRECT(ADDRESS(ROW(),COLUMN())),0,-1))>21,BM76-7,BM76+0))","v":"2031-01-21"},null,"2030-12-24",{"$f":"IF(DAY(OFFSET(INDIRECT(ADDRESS(ROW(),COLUMN())),0,-1))<21,BP76+7,IF(DAY(OFFSET(INDIRECT(ADDRESS(ROW(),COLUMN())),0,-1))>28,BP76-7,BP76+0))","v":"2030-12-24"},null,"2028-07-31",{"$f":"IF(DAY(OFFSET(INDIRECT(ADDRESS(ROW(),COLUMN())),0,-1))>21,BS76+7,IF(DAY(OFFSET(INDIRECT(ADDRESS(ROW(),COLUMN())),0,-1))<7,BS76+0,IF(AND(DAY(OFFSET(INDIRECT(ADDRESS(ROW(),COLUMN())),0,-1))>7,DAY(OFFSET(INDIRECT(ADDRESS(ROW(),COLUMN())),0,-1))<15),BS76+7,BS76+0)))","v":"2028-08-07"},null,"2031-01-21",{"$f":"IF(DAY(OFFSET(INDIRECT(ADDRESS(ROW(),COLUMN())),0,-1))<15,BV76+7,IF(DAY(OFFSET(INDIRECT(ADDRESS(ROW(),COLUMN())),0,-1))>21,BV76-7,BV76+0))","v":"2031-01-21"},null,"2029-07-03",{"$f":"IF(DAY(OFFSET(INDIRECT(ADDRESS(ROW(),COLUMN())),0,-1))>21,BY76+7,IF(DAY(OFFSET(INDIRECT(ADDRESS(ROW(),COLUMN())),0,-1))<7,BY76+0,IF(AND(DAY(OFFSET(INDIRECT(ADDRESS(ROW(),COLUMN())),0,-1))>7,DAY(OFFSET(INDIRECT(ADDRESS(ROW(),COLUMN())),0,-1))<15),BY76+7,BY76+0)))","v":"2029-07-03"},null,"2028-04-04",null,null,null,null,null,"2031-01-02",{"$f":"IF(DAY(OFFSET(INDIRECT(ADDRESS(ROW(),COLUMN())),0,-1))<7,CH76+0,IF(DAY(OFFSET(INDIRECT(ADDRESS(ROW(),COLUMN())),0,-1))>7,CH76-7,CH76+0))","v":"2031-01-02"},null,"2029-07-05",null,null,"2031-01-07",{"$f":"IF(DAY(OFFSET(INDIRECT(ADDRESS(ROW(),COLUMN())),0,-1))<8,CN76+7,CN76+0)","v":"2031-01-14"},null,"2031-01-06",{"$f":"IF(DAY(OFFSET(INDIRECT(ADDRESS(ROW(),COLUMN())),0,-1))<7,CQ76+0,IF(DAY(OFFSET(INDIRECT(ADDRESS(ROW(),COLUMN())),0,-1))>7,CQ76-7,CQ76+0))","v":"2031-01-06"},null,"2031-01-06",{"$f":"IF(DAY(OFFSET(INDIRECT(ADDRESS(ROW(),COLUMN())),0,-1))<7,CT76+0,IF(DAY(OFFSET(INDIRECT(ADDRESS(ROW(),COLUMN())),0,-1))>7,CT76-7,CT76+0))+3","v":"2031-01-09"},null,"2031-01-06",{"$f":"IF(DAY(OFFSET(INDIRECT(ADDRESS(ROW(),COLUMN())),0,-1))<8,CW76+7,CW76+0)","v":"2031-01-13"},null,"2032-01-19",{"$f":"IF(DAY(OFFSET(INDIRECT(ADDRESS(ROW(),COLUMN())),0,-1))<15,CZ76+7,IF(DAY(OFFSET(INDIRECT(ADDRESS(ROW(),COLUMN())),0,-1))>21,CZ76-7,CZ76+0))","v":"2032-01-19"}]
[null,null,null,null,null,"Div 9","City of Thomasville",{"$f":"CY40","v":"2028-04-17"},"City of Thomasville",30,14,7,null,"2029-07-16",{"$f":"IF(DAY(OFFSET(INDIRECT(ADDRESS(ROW(),COLUMN())),0,-1))>21,N77+7,IF(DAY(OFFSET(INDIRECT(ADDRESS(ROW(),COLUMN())),0,-1))<7,N77+0,IF(AND(DAY(OFFSET(INDIRECT(ADDRESS(ROW(),COLUMN())),0,-1))>7,DAY(OFFSET(INDIRECT(ADDRESS(ROW(),COLUMN())),0,-1))<15),N77+7,N77+0)))","v":"2029-07-16"},null,"2029-07-17",{"$f":"IF(DAY(OFFSET(INDIRECT(ADDRESS(ROW(),COLUMN())),0,-1))>21,Q77+7,IF(DAY(OFFSET(INDIRECT(ADDRESS(ROW(),COLUMN())),0,-1))<7,Q77+0,IF(AND(DAY(OFFSET(INDIRECT(ADDRESS(ROW(),COLUMN())),0,-1))>7,DAY(OFFSET(INDIRECT(ADDRESS(ROW(),COLUMN())),0,-1))<15),Q77+7,Q77+0)))","v":"2029-07-17"},null,"2028-09-12",{"$f":"IF(DAY(OFFSET(INDIRECT(ADDRESS(ROW(),COLUMN())),0,-1))<8,T77+7,T77+0)","v":"2028-09-12"},null,"2029-07-16",{"$f":"IF(DAY(OFFSET(INDIRECT(ADDRESS(ROW(),COLUMN())),0,-1))>21,W77+7,IF(DAY(OFFSET(INDIRECT(ADDRESS(ROW(),COLUMN())),0,-1))<7,W77+0,IF(AND(DAY(OFFSET(INDIRECT(ADDRESS(ROW(),COLUMN())),0,-1))>7,DAY(OFFSET(INDIRECT(ADDRESS(ROW(),COLUMN())),0,-1))<15),W77+7,W77+0)))","v":"2029-07-16"},null,"2028-09-14",null,null,null,null,null,null,null,null,null,null,null,null,null,null,null,null,null,"2028-09-12",{"$f":"IF(DAY(OFFSET(INDIRECT(ADDRESS(ROW(),COLUMN())),0,-1))<8,AR77+7,AR77+0)","v":"2028-09-12"},null,"2029-07-16",{"$f":"IF(DAY(OFFSET(INDIRECT(ADDRESS(ROW(),COLUMN())),0,-1))>21,AU77+7,IF(DAY(OFFSET(INDIRECT(ADDRESS(ROW(),COLUMN())),0,-1))<7,AU77+0,IF(AND(DAY(OFFSET(INDIRECT(ADDRESS(ROW(),COLUMN())),0,-1))>7,DAY(OFFSET(INDIRECT(ADDRESS(ROW(),COLUMN())),0,-1))<15),AU77+7,AU77+0)))","v":"2029-07-16"},null,"2028-09-19",{"$f":"IF(DAY(OFFSET(INDIRECT(ADDRESS(ROW(),COLUMN())),0,-1))<16,AX77+7,AX77+0)","v":"2028-09-19"},null,"2029-07-19",{"$f":"IF(DAY(OFFSET(INDIRECT(ADDRESS(ROW(),COLUMN())),0,-1))>21,BA77+7,IF(DAY(OFFSET(INDIRECT(ADDRESS(ROW(),COLUMN())),0,-1))<7,BA77+0,IF(AND(DAY(OFFSET(INDIRECT(ADDRESS(ROW(),COLUMN())),0,-1))>7,DAY(OFFSET(INDIRECT(ADDRESS(ROW(),COLUMN())),0,-1))<15),BA77+7,BA77+0)))","v":"2029-07-19"},null,"2029-07-17",{"$f":"IF(DAY(OFFSET(INDIRECT(ADDRESS(ROW(),COLUMN())),0,-1))>21,BD77+7,IF(DAY(OFFSET(INDIRECT(ADDRESS(ROW(),COLUMN())),0,-1))<7,BD77+0,IF(AND(DAY(OFFSET(INDIRECT(ADDRESS(ROW(),COLUMN())),0,-1))>7,DAY(OFFSET(INDIRECT(ADDRESS(ROW(),COLUMN())),0,-1))<15),BD77+7,BD77+0)))","v":"2029-07-17"},null,"2029-07-17",null,null,"2030-01-17",null,null,"2031-02-18",{"$f":"IF(DAY(OFFSET(INDIRECT(ADDRESS(ROW(),COLUMN())),0,-1))<15,BM77+7,IF(DAY(OFFSET(INDIRECT(ADDRESS(ROW(),COLUMN())),0,-1))>21,BM77-7,BM77+0))","v":"2031-02-18"},null,"2028-09-26",{"$f":"IF(DAY(OFFSET(INDIRECT(ADDRESS(ROW(),COLUMN())),0,-1))<21,BP77+7,IF(DAY(OFFSET(INDIRECT(ADDRESS(ROW(),COLUMN())),0,-1))>28,BP77-7,BP77+0))","v":"2028-09-26"},null,"2028-08-14",{"$f":"IF((DAY(BS77))<DAY(13),BS77+10,IF((DAY(BS77))>=DAY(20),BS77-5,BS77+2))","v":"2028-08-16"},null,"2031-02-18",{"$f":"IF(DAY(OFFSET(INDIRECT(ADDRESS(ROW(),COLUMN())),0,-1))<15,BV77+7,IF(DAY(OFFSET(INDIRECT(ADDRESS(ROW(),COLUMN())),0,-1))>21,BV77-7,BV77+0))","v":"2031-02-18"},null,"2029-07-17",{"$f":"IF(DAY(OFFSET(INDIRECT(ADDRESS(ROW(),COLUMN())),0,-1))>21,BY77+7,IF(DAY(OFFSET(INDIRECT(ADDRESS(ROW(),COLUMN())),0,-1))<7,BY77+0,IF(AND(DAY(OFFSET(INDIRECT(ADDRESS(ROW(),COLUMN())),0,-1))>7,DAY(OFFSET(INDIRECT(ADDRESS(ROW(),COLUMN())),0,-1))<15),BY77+7,BY77+0)))","v":"2029-07-17"},null,"2028-04-18",null,null,null,null,null,"2031-02-06",{"$f":"IF(DAY(OFFSET(INDIRECT(ADDRESS(ROW(),COLUMN())),0,-1))<7,CH77+0,IF(DAY(OFFSET(INDIRECT(ADDRESS(ROW(),COLUMN())),0,-1))>7,CH77-7,CH77+0))","v":"2031-02-06"},null,"2029-08-02",null,null,"2028-09-12",{"$f":"IF(DAY(OFFSET(INDIRECT(ADDRESS(ROW(),COLUMN())),0,-1))<8,CN77+7,CN77+0)","v":"2028-09-12"},null,"2028-09-04",{"$f":"IF(DAY(OFFSET(INDIRECT(ADDRESS(ROW(),COLUMN())),0,-1))<7,CQ77+0,IF(DAY(OFFSET(INDIRECT(ADDRESS(ROW(),COLUMN())),0,-1))>7,CQ77-7,CQ77+0))","v":"2028-09-04"},null,"2031-02-03",{"$f":"IF(DAY(OFFSET(INDIRECT(ADDRESS(ROW(),COLUMN())),0,-1))<7,CT77+0,IF(DAY(OFFSET(INDIRECT(ADDRESS(ROW(),COLUMN())),0,-1))>7,CT77-7,CT77+0))+3","v":"2031-02-06"},null,"2028-09-04",{"$f":"IF(DAY(OFFSET(INDIRECT(ADDRESS(ROW(),COLUMN())),0,-1))<8,CW77+7,CW77+0)","v":"2028-09-11"},null,"2028-09-18",{"$f":"IF(DAY(OFFSET(INDIRECT(ADDRESS(ROW(),COLUMN())),0,-1))<15,CZ77+7,IF(DAY(OFFSET(INDIRECT(ADDRESS(ROW(),COLUMN())),0,-1))>21,CZ77-7,CZ77+0))","v":"2028-09-18"}]
[null,null,null,null,null,"Div 9","Town of Kernersville",{"$f":"DB53","v":"2028-04-17"},"Town of Kernersville",0,7,30,null,"2029-07-30",{"$f":"IF(DAY(OFFSET(INDIRECT(ADDRESS(ROW(),COLUMN())),0,-1))>21,N78+7,IF(DAY(OFFSET(INDIRECT(ADDRESS(ROW(),COLUMN())),0,-1))<7,N78+0,IF(AND(DAY(OFFSET(INDIRECT(ADDRESS(ROW(),COLUMN())),0,-1))>7,DAY(OFFSET(INDIRECT(ADDRESS(ROW(),COLUMN())),0,-1))<15),N78+7,N78+0)))","v":"2029-08-06"},null,"2029-08-07",{"$f":"IF(DAY(OFFSET(INDIRECT(ADDRESS(ROW(),COLUMN())),0,-1))>21,Q78+7,IF(DAY(OFFSET(INDIRECT(ADDRESS(ROW(),COLUMN())),0,-1))<7,Q78+0,IF(AND(DAY(OFFSET(INDIRECT(ADDRESS(ROW(),COLUMN())),0,-1))>7,DAY(OFFSET(INDIRECT(ADDRESS(ROW(),COLUMN())),0,-1))<15),Q78+7,Q78+0)))","v":"2029-08-07"},null,"2028-10-10",{"$f":"IF(DAY(OFFSET(INDIRECT(ADDRESS(ROW(),COLUMN())),0,-1))<8,T78+7,T78+0)","v":"2028-10-10"},null,"2029-07-30",{"$f":"IF(DAY(OFFSET(INDIRECT(ADDRESS(ROW(),COLUMN())),0,-1))>21,W78+7,IF(DAY(OFFSET(INDIRECT(ADDRESS(ROW(),COLUMN())),0,-1))<7,W78+0,IF(AND(DAY(OFFSET(INDIRECT(ADDRESS(ROW(),COLUMN())),0,-1))>7,DAY(OFFSET(INDIRECT(ADDRESS(ROW(),COLUMN())),0,-1))<15),W78+7,W78+0)))","v":"2029-08-06"},null,"2028-10-12",null,null,null,null,null,null,null,null,null,null,null,null,null,null,null,null,null,"2028-10-10",{"$f":"IF(DAY(OFFSET(INDIRECT(ADDRESS(ROW(),COLUMN())),0,-1))<8,AR78+7,AR78+0)","v":"2028-10-10"},null,"2029-07-30",{"$f":"IF(DAY(OFFSET(INDIRECT(ADDRESS(ROW(),COLUMN())),0,-1))>21,AU78+7,IF(DAY(OFFSET(INDIRECT(ADDRESS(ROW(),COLUMN())),0,-1))<7,AU78+0,IF(AND(DAY(OFFSET(INDIRECT(ADDRESS(ROW(),COLUMN())),0,-1))>7,DAY(OFFSET(INDIRECT(ADDRESS(ROW(),COLUMN())),0,-1))<15),AU78+7,AU78+0)))","v":"2029-08-06"},null,"2028-10-17",{"$f":"IF(DAY(OFFSET(INDIRECT(ADDRESS(ROW(),COLUMN())),0,-1))<16,AX78+7,AX78+0)","v":"2028-10-17"},null,"2029-08-02",{"$f":"IF(DAY(OFFSET(INDIRECT(ADDRESS(ROW(),COLUMN())),0,-1))>21,BA78+7,IF(DAY(OFFSET(INDIRECT(ADDRESS(ROW(),COLUMN())),0,-1))<7,BA78+0,IF(AND(DAY(OFFSET(INDIRECT(ADDRESS(ROW(),COLUMN())),0,-1))>7,DAY(OFFSET(INDIRECT(ADDRESS(ROW(),COLUMN())),0,-1))<15),BA78+7,BA78+0)))","v":"2029-08-02"},null,"2029-07-30",{"$f":"IF(DAY(OFFSET(INDIRECT(ADDRESS(ROW(),COLUMN())),0,-1))>21,BD78+7,IF(DAY(OFFSET(INDIRECT(ADDRESS(ROW(),COLUMN())),0,-1))<7,BD78+0,IF(AND(DAY(OFFSET(INDIRECT(ADDRESS(ROW(),COLUMN())),0,-1))>7,DAY(OFFSET(INDIRECT(ADDRESS(ROW(),COLUMN())),0,-1))<15),BD78+7,BD78+0)))","v":"2029-08-06"},null,"2029-07-31",null,null,null,null,null,"2031-03-18",{"$f":"IF(DAY(OFFSET(INDIRECT(ADDRESS(ROW(),COLUMN())),0,-1))<15,BM78+7,IF(DAY(OFFSET(INDIRECT(ADDRESS(ROW(),COLUMN())),0,-1))>21,BM78-7,BM78+0))","v":"2031-03-18"},null,"2028-10-24",{"$f":"IF(DAY(OFFSET(INDIRECT(ADDRESS(ROW(),COLUMN())),0,-1))<21,BP78+7,IF(DAY(OFFSET(INDIRECT(ADDRESS(ROW(),COLUMN())),0,-1))>28,BP78-7,BP78+0))","v":"2028-10-24"},null,null,{"$f":"IF(DAY(BT77)=DAY(21),BT77-6,BT77+1)","v":"2028-08-17"},null,"2031-03-18",{"$f":"IF(DAY(OFFSET(INDIRECT(ADDRESS(ROW(),COLUMN())),0,-1))<15,BV78+7,IF(DAY(OFFSET(INDIRECT(ADDRESS(ROW(),COLUMN())),0,-1))>21,BV78-7,BV78+0))","v":"2031-03-18"},null,"2029-08-07",{"$f":"IF(DAY(OFFSET(INDIRECT(ADDRESS(ROW(),COLUMN())),0,-1))>21,BY78+7,IF(DAY(OFFSET(INDIRECT(ADDRESS(ROW(),COLUMN())),0,-1))<7,BY78+0,IF(AND(DAY(OFFSET(INDIRECT(ADDRESS(ROW(),COLUMN())),0,-1))>7,DAY(OFFSET(INDIRECT(ADDRESS(ROW(),COLUMN())),0,-1))<15),BY78+7,BY78+0)))","v":"2029-08-07"},null,"2028-05-02",null,null,null,null,null,"2031-03-06",{"$f":"IF(DAY(OFFSET(INDIRECT(ADDRESS(ROW(),COLUMN())),0,-1))<7,CH78+0,IF(DAY(OFFSET(INDIRECT(ADDRESS(ROW(),COLUMN())),0,-1))>7,CH78-7,CH78+0))","v":"2031-03-06"},null,null,null,null,"2028-10-10",{"$f":"IF(DAY(OFFSET(INDIRECT(ADDRESS(ROW(),COLUMN())),0,-1))<8,CN78+7,CN78+0)","v":"2028-10-10"},null,"2028-10-02",{"$f":"IF(DAY(OFFSET(INDIRECT(ADDRESS(ROW(),COLUMN())),0,-1))<7,CQ78+0,IF(DAY(OFFSET(INDIRECT(ADDRESS(ROW(),COLUMN())),0,-1))>7,CQ78-7,CQ78+0))","v":"2028-10-02"},null,"2031-03-03",{"$f":"IF(DAY(OFFSET(INDIRECT(ADDRESS(ROW(),COLUMN())),0,-1))<7,CT78+0,IF(DAY(OFFSET(INDIRECT(ADDRESS(ROW(),COLUMN())),0,-1))>7,CT78-7,CT78+0))+3","v":"2031-03-06"},null,"2028-10-02",{"$f":"IF(DAY(OFFSET(INDIRECT(ADDRESS(ROW(),COLUMN())),0,-1))<8,CW78+7,CW78+0)","v":"2028-10-09"},null,"2028-10-16",{"$f":"IF(DAY(OFFSET(INDIRECT(ADDRESS(ROW(),COLUMN())),0,-1))<15,CZ78+7,IF(DAY(OFFSET(INDIRECT(ADDRESS(ROW(),COLUMN())),0,-1))>21,CZ78-7,CZ78+0))","v":"2028-10-16"}]
[null,null,null,null,null,"Div 9","Village of Clemmons",{"$f":"I34","v":"2028-08-14"},"Village of Clemmons",30,60,30,null,"2029-08-13",{"$f":"IF(DAY(OFFSET(INDIRECT(ADDRESS(ROW(),COLUMN())),0,-1))>21,N79+7,IF(DAY(OFFSET(INDIRECT(ADDRESS(ROW(),COLUMN())),0,-1))<7,N79+0,IF(AND(DAY(OFFSET(INDIRECT(ADDRESS(ROW(),COLUMN())),0,-1))>7,DAY(OFFSET(INDIRECT(ADDRESS(ROW(),COLUMN())),0,-1))<15),N79+7,N79+0)))","v":"2029-08-20"},null,"2029-08-21",{"$f":"IF(DAY(OFFSET(INDIRECT(ADDRESS(ROW(),COLUMN())),0,-1))>21,Q79+7,IF(DAY(OFFSET(INDIRECT(ADDRESS(ROW(),COLUMN())),0,-1))<7,Q79+0,IF(AND(DAY(OFFSET(INDIRECT(ADDRESS(ROW(),COLUMN())),0,-1))>7,DAY(OFFSET(INDIRECT(ADDRESS(ROW(),COLUMN())),0,-1))<15),Q79+7,Q79+0)))","v":"2029-08-21"},null,"2028-11-07",{"$f":"IF(DAY(OFFSET(INDIRECT(ADDRESS(ROW(),COLUMN())),0,-1))<8,T79+7,T79+0)","v":"2028-11-14"},null,"2029-08-13",{"$f":"IF(DAY(OFFSET(INDIRECT(ADDRESS(ROW(),COLUMN())),0,-1))>21,W79+7,IF(DAY(OFFSET(INDIRECT(ADDRESS(ROW(),COLUMN())),0,-1))<7,W79+0,IF(AND(DAY(OFFSET(INDIRECT(ADDRESS(ROW(),COLUMN())),0,-1))>7,DAY(OFFSET(INDIRECT(ADDRESS(ROW(),COLUMN())),0,-1))<15),W79+7,W79+0)))","v":"2029-08-20"},null,"2028-11-09",null,null,null,null,null,null,null,null,null,null,null,null,null,null,null,null,null,"2028-11-07",{"$f":"IF(DAY(OFFSET(INDIRECT(ADDRESS(ROW(),COLUMN())),0,-1))<8,AR79+7,AR79+0)","v":"2028-11-14"},null,"2029-08-13",{"$f":"IF(DAY(OFFSET(INDIRECT(ADDRESS(ROW(),COLUMN())),0,-1))>21,AU79+7,IF(DAY(OFFSET(INDIRECT(ADDRESS(ROW(),COLUMN())),0,-1))<7,AU79+0,IF(AND(DAY(OFFSET(INDIRECT(ADDRESS(ROW(),COLUMN())),0,-1))>7,DAY(OFFSET(INDIRECT(ADDRESS(ROW(),COLUMN())),0,-1))<15),AU79+7,AU79+0)))","v":"2029-08-20"},null,"2028-11-21",{"$f":"IF(DAY(OFFSET(INDIRECT(ADDRESS(ROW(),COLUMN())),0,-1))<16,AX79+7,AX79+0)","v":"2028-11-21"},null,"2029-08-16",{"$f":"IF(DAY(OFFSET(INDIRECT(ADDRESS(ROW(),COLUMN())),0,-1))>21,BA79+7,IF(DAY(OFFSET(INDIRECT(ADDRESS(ROW(),COLUMN())),0,-1))<7,BA79+0,IF(AND(DAY(OFFSET(INDIRECT(ADDRESS(ROW(),COLUMN())),0,-1))>7,DAY(OFFSET(INDIRECT(ADDRESS(ROW(),COLUMN())),0,-1))<15),BA79+7,BA79+0)))","v":"2029-08-16"},null,"2029-08-21",{"$f":"IF(DAY(OFFSET(INDIRECT(ADDRESS(ROW(),COLUMN())),0,-1))>21,BD79+7,IF(DAY(OFFSET(INDIRECT(ADDRESS(ROW(),COLUMN())),0,-1))<7,BD79+0,IF(AND(DAY(OFFSET(INDIRECT(ADDRESS(ROW(),COLUMN())),0,-1))>7,DAY(OFFSET(INDIRECT(ADDRESS(ROW(),COLUMN())),0,-1))<15),BD79+7,BD79+0)))","v":"2029-08-21"},null,"2029-08-14",null,null,null,null,null,"2028-11-21",{"$f":"IF(DAY(OFFSET(INDIRECT(ADDRESS(ROW(),COLUMN())),0,-1))<15,BM79+7,IF(DAY(OFFSET(INDIRECT(ADDRESS(ROW(),COLUMN())),0,-1))>21,BM79-7,BM79+0))","v":"2028-11-21"},null,"2028-11-28",{"$f":"IF(DAY(OFFSET(INDIRECT(ADDRESS(ROW(),COLUMN())),0,-1))<21,BP79+7,IF(DAY(OFFSET(INDIRECT(ADDRESS(ROW(),COLUMN())),0,-1))>28,BP79-7,BP79+0))","v":"2028-11-28"},null,"2028-09-04",{"$f":"IF(DAY(OFFSET(INDIRECT(ADDRESS(ROW(),COLUMN())),0,-1))>21,BS79+7,IF(DAY(OFFSET(INDIRECT(ADDRESS(ROW(),COLUMN())),0,-1))<7,BS79+0,IF(AND(DAY(OFFSET(INDIRECT(ADDRESS(ROW(),COLUMN())),0,-1))>7,DAY(OFFSET(INDIRECT(ADDRESS(ROW(),COLUMN())),0,-1))<15),BS79+7,BS79+0)))","v":"2028-09-04"},null,"2031-04-22",{"$f":"IF(DAY(OFFSET(INDIRECT(ADDRESS(ROW(),COLUMN())),0,-1))<15,BV79+7,IF(DAY(OFFSET(INDIRECT(ADDRESS(ROW(),COLUMN())),0,-1))>21,BV79-7,BV79+0))","v":"2031-04-15"},null,"2029-08-21",{"$f":"IF(DAY(OFFSET(INDIRECT(ADDRESS(ROW(),COLUMN())),0,-1))>21,BY79+7,IF(DAY(OFFSET(INDIRECT(ADDRESS(ROW(),COLUMN())),0,-1))<7,BY79+0,IF(AND(DAY(OFFSET(INDIRECT(ADDRESS(ROW(),COLUMN())),0,-1))>7,DAY(OFFSET(INDIRECT(ADDRESS(ROW(),COLUMN())),0,-1))<15),BY79+7,BY79+0)))","v":"2029-08-21"},null,"2028-05-16",null,null,null,null,null,"2028-11-02",{"$f":"IF(DAY(OFFSET(INDIRECT(ADDRESS(ROW(),COLUMN())),0,-1))<7,CH79+0,IF(DAY(OFFSET(INDIRECT(ADDRESS(ROW(),COLUMN())),0,-1))>7,CH79-7,CH79+0))","v":"2028-11-02"},null,null,null,null,"2028-11-07",{"$f":"IF(DAY(OFFSET(INDIRECT(ADDRESS(ROW(),COLUMN())),0,-1))<8,CN79+7,CN79+0)","v":"2028-11-14"},null,"2028-11-06",{"$f":"IF(DAY(OFFSET(INDIRECT(ADDRESS(ROW(),COLUMN())),0,-1))<7,CQ79+0,IF(DAY(OFFSET(INDIRECT(ADDRESS(ROW(),COLUMN())),0,-1))>7,CQ79-7,CQ79+0))","v":"2028-11-06"},null,"2031-04-07",{"$f":"IF(DAY(OFFSET(INDIRECT(ADDRESS(ROW(),COLUMN())),0,-1))<7,CT79+0,IF(DAY(OFFSET(INDIRECT(ADDRESS(ROW(),COLUMN())),0,-1))>7,CT79-7,CT79+0))+3","v":"2031-04-10"},null,"2028-11-06",{"$f":"IF(DAY(OFFSET(INDIRECT(ADDRESS(ROW(),COLUMN())),0,-1))<8,CW79+7,CW79+0)","v":"2028-11-13"},null,"2028-11-20",{"$f":"IF(DAY(OFFSET(INDIRECT(ADDRESS(ROW(),COLUMN())),0,-1))<15,CZ79+7,IF(DAY(OFFSET(INDIRECT(ADDRESS(ROW(),COLUMN())),0,-1))>21,CZ79-7,CZ79+0))","v":"2028-11-20"}]
[null,null,null,null,null,"Div 9","City of Lexington",{"$f":"M40","v":"2028-08-21"},"City of Lexington",14,14,0,null,"2029-09-03",{"$f":"IF(DAY(OFFSET(INDIRECT(ADDRESS(ROW(),COLUMN())),0,-1))>21,N80+7,IF(DAY(OFFSET(INDIRECT(ADDRESS(ROW(),COLUMN())),0,-1))<7,N80+0,IF(AND(DAY(OFFSET(INDIRECT(ADDRESS(ROW(),COLUMN())),0,-1))>7,DAY(OFFSET(INDIRECT(ADDRESS(ROW(),COLUMN())),0,-1))<15),N80+7,N80+0)))","v":"2029-09-03"},null,"2029-09-04",{"$f":"IF(DAY(OFFSET(INDIRECT(ADDRESS(ROW(),COLUMN())),0,-1))>21,Q80+7,IF(DAY(OFFSET(INDIRECT(ADDRESS(ROW(),COLUMN())),0,-1))<7,Q80+0,IF(AND(DAY(OFFSET(INDIRECT(ADDRESS(ROW(),COLUMN())),0,-1))>7,DAY(OFFSET(INDIRECT(ADDRESS(ROW(),COLUMN())),0,-1))<15),Q80+7,Q80+0)))","v":"2029-09-04"},null,"2028-12-12",{"$f":"IF(DAY(OFFSET(INDIRECT(ADDRESS(ROW(),COLUMN())),0,-1))<8,T80+7,T80+0)","v":"2028-12-12"},null,"2029-09-03",{"$f":"IF(DAY(OFFSET(INDIRECT(ADDRESS(ROW(),COLUMN())),0,-1))>21,W80+7,IF(DAY(OFFSET(INDIRECT(ADDRESS(ROW(),COLUMN())),0,-1))<7,W80+0,IF(AND(DAY(OFFSET(INDIRECT(ADDRESS(ROW(),COLUMN())),0,-1))>7,DAY(OFFSET(INDIRECT(ADDRESS(ROW(),COLUMN())),0,-1))<15),W80+7,W80+0)))","v":"2029-09-03"},null,"2028-12-14",null,null,null,null,null,null,null,null,null,null,null,null,null,null,null,null,null,"2028-12-12",{"$f":"IF(DAY(OFFSET(INDIRECT(ADDRESS(ROW(),COLUMN())),0,-1))<8,AR80+7,AR80+0)","v":"2028-12-12"},null,"2029-09-03",{"$f":"IF(DAY(OFFSET(INDIRECT(ADDRESS(ROW(),COLUMN())),0,-1))>21,AU80+7,IF(DAY(OFFSET(INDIRECT(ADDRESS(ROW(),COLUMN())),0,-1))<7,AU80+0,IF(AND(DAY(OFFSET(INDIRECT(ADDRESS(ROW(),COLUMN())),0,-1))>7,DAY(OFFSET(INDIRECT(ADDRESS(ROW(),COLUMN())),0,-1))<15),AU80+7,AU80+0)))","v":"2029-09-03"},null,"2028-12-19",{"$f":"IF(DAY(OFFSET(INDIRECT(ADDRESS(ROW(),COLUMN())),0,-1))<16,AX80+7,AX80+0)","v":"2028-12-19"},null,"2029-08-30",{"$f":"IF(DAY(OFFSET(INDIRECT(ADDRESS(ROW(),COLUMN())),0,-1))>21,BA80+7,IF(DAY(OFFSET(INDIRECT(ADDRESS(ROW(),COLUMN())),0,-1))<7,BA80+0,IF(AND(DAY(OFFSET(INDIRECT(ADDRESS(ROW(),COLUMN())),0,-1))>7,DAY(OFFSET(INDIRECT(ADDRESS(ROW(),COLUMN())),0,-1))<15),BA80+7,BA80+0)))","v":"2029-09-06"},null,"2029-09-03",{"$f":"IF(DAY(OFFSET(INDIRECT(ADDRESS(ROW(),COLUMN())),0,-1))>21,BD80+7,IF(DAY(OFFSET(INDIRECT(ADDRESS(ROW(),COLUMN())),0,-1))<7,BD80+0,IF(AND(DAY(OFFSET(INDIRECT(ADDRESS(ROW(),COLUMN())),0,-1))>7,DAY(OFFSET(INDIRECT(ADDRESS(ROW(),COLUMN())),0,-1))<15),BD80+7,BD80+0)))","v":"2029-09-03"},null,"2029-09-04",null,null,null,null,null,"2028-12-19",{"$f":"IF(DAY(OFFSET(INDIRECT(ADDRESS(ROW(),COLUMN())),0,-1))<15,BM80+7,IF(DAY(OFFSET(INDIRECT(ADDRESS(ROW(),COLUMN())),0,-1))>21,BM80-7,BM80+0))","v":"2028-12-19"},null,"2028-12-26",{"$f":"IF(DAY(OFFSET(INDIRECT(ADDRESS(ROW(),COLUMN())),0,-1))<21,BP80+7,IF(DAY(OFFSET(INDIRECT(ADDRESS(ROW(),COLUMN())),0,-1))>28,BP80-7,BP80+0))","v":"2028-12-26"},null,"2028-09-18",{"$f":"IF((DAY(BS80))<DAY(13),BS80+10,IF((DAY(BS80))>=DAY(20),BS80-5,BS80+2))","v":"2028-09-20"},null,"2031-05-20",{"$f":"IF(DAY(OFFSET(INDIRECT(ADDRESS(ROW(),COLUMN())),0,-1))<15,BV80+7,IF(DAY(OFFSET(INDIRECT(ADDRESS(ROW(),COLUMN())),0,-1))>21,BV80-7,BV80+0))","v":"2031-05-20"},null,"2029-09-04",{"$f":"IF(DAY(OFFSET(INDIRECT(ADDRESS(ROW(),COLUMN())),0,-1))>21,BY80+7,IF(DAY(OFFSET(INDIRECT(ADDRESS(ROW(),COLUMN())),0,-1))<7,BY80+0,IF(AND(DAY(OFFSET(INDIRECT(ADDRESS(ROW(),COLUMN())),0,-1))>7,DAY(OFFSET(INDIRECT(ADDRESS(ROW(),COLUMN())),0,-1))<15),BY80+7,BY80+0)))","v":"2029-09-04"},null,"2028-06-06",null,null,null,null,null,"2028-12-07",{"$f":"IF(DAY(OFFSET(INDIRECT(ADDRESS(ROW(),COLUMN())),0,-1))<7,CH80+0,IF(DAY(OFFSET(INDIRECT(ADDRESS(ROW(),COLUMN())),0,-1))>7,CH80-7,CH80+0))","v":"2028-12-07"},null,null,null,null,"2028-12-12",{"$f":"IF(DAY(OFFSET(INDIRECT(ADDRESS(ROW(),COLUMN())),0,-1))<8,CN80+7,CN80+0)","v":"2028-12-12"},null,"2028-12-04",{"$f":"IF(DAY(OFFSET(INDIRECT(ADDRESS(ROW(),COLUMN())),0,-1))<7,CQ80+0,IF(DAY(OFFSET(INDIRECT(ADDRESS(ROW(),COLUMN())),0,-1))>7,CQ80-7,CQ80+0))","v":"2028-12-04"},null,"2031-05-05",{"$f":"IF(DAY(OFFSET(INDIRECT(ADDRESS(ROW(),COLUMN())),0,-1))<7,CT80+0,IF(DAY(OFFSET(INDIRECT(ADDRESS(ROW(),COLUMN())),0,-1))>7,CT80-7,CT80+0))+3","v":"2031-05-08"},null,"2028-12-04",{"$f":"IF(DAY(OFFSET(INDIRECT(ADDRESS(ROW(),COLUMN())),0,-1))<8,CW80+7,CW80+0)","v":"2028-12-11"},null,"2028-12-18",{"$f":"IF(DAY(OFFSET(INDIRECT(ADDRESS(ROW(),COLUMN())),0,-1))<15,CZ80+7,IF(DAY(OFFSET(INDIRECT(ADDRESS(ROW(),COLUMN())),0,-1))>21,CZ80-7,CZ80+0))","v":"2028-12-18"}]
[null,null,null,null,null,"Div 9","Town of Lewisville",{"$f":"S40","v":"2028-08-15"},"Town of Lewisville",0,7,0,null,"2027-07-05",{"$f":"IF(DAY(OFFSET(INDIRECT(ADDRESS(ROW(),COLUMN())),0,-1))>21,N81+7,IF(DAY(OFFSET(INDIRECT(ADDRESS(ROW(),COLUMN())),0,-1))<7,N81+0,IF(AND(DAY(OFFSET(INDIRECT(ADDRESS(ROW(),COLUMN())),0,-1))>7,DAY(OFFSET(INDIRECT(ADDRESS(ROW(),COLUMN())),0,-1))<15),N81+7,N81+0)))","v":"2027-07-05"},null,"2026-09-15",{"$f":"IF(DAY(OFFSET(INDIRECT(ADDRESS(ROW(),COLUMN())),0,-1))>21,Q81+7,IF(DAY(OFFSET(INDIRECT(ADDRESS(ROW(),COLUMN())),0,-1))<7,Q81+0,IF(AND(DAY(OFFSET(INDIRECT(ADDRESS(ROW(),COLUMN())),0,-1))>7,DAY(OFFSET(INDIRECT(ADDRESS(ROW(),COLUMN())),0,-1))<15),Q81+7,Q81+0)))","v":"2026-09-15"},null,"2029-01-09",{"$f":"IF(DAY(OFFSET(INDIRECT(ADDRESS(ROW(),COLUMN())),0,-1))<8,T81+7,T81+0)","v":"2029-01-09"},null,"2027-09-13",{"$f":"IF(DAY(OFFSET(INDIRECT(ADDRESS(ROW(),COLUMN())),0,-1))>21,W81+7,IF(DAY(OFFSET(INDIRECT(ADDRESS(ROW(),COLUMN())),0,-1))<7,W81+0,IF(AND(DAY(OFFSET(INDIRECT(ADDRESS(ROW(),COLUMN())),0,-1))>7,DAY(OFFSET(INDIRECT(ADDRESS(ROW(),COLUMN())),0,-1))<15),W81+7,W81+0)))","v":"2027-09-20"},null,"2029-01-11",null,null,null,null,null,null,null,null,null,null,null,null,null,null,null,null,null,"2029-01-09",{"$f":"IF(DAY(OFFSET(INDIRECT(ADDRESS(ROW(),COLUMN())),0,-1))<8,AR81+7,AR81+0)","v":"2029-01-09"},null,"2027-09-13",{"$f":"IF(DAY(OFFSET(INDIRECT(ADDRESS(ROW(),COLUMN())),0,-1))>21,AU81+7,IF(DAY(OFFSET(INDIRECT(ADDRESS(ROW(),COLUMN())),0,-1))<7,AU81+0,IF(AND(DAY(OFFSET(INDIRECT(ADDRESS(ROW(),COLUMN())),0,-1))>7,DAY(OFFSET(INDIRECT(ADDRESS(ROW(),COLUMN())),0,-1))<15),AU81+7,AU81+0)))","v":"2027-09-20"},null,"2029-01-16",{"$f":"IF(DAY(OFFSET(INDIRECT(ADDRESS(ROW(),COLUMN())),0,-1))<16,AX81+7,AX81+0)","v":"2029-01-16"},null,"2029-09-13",{"$f":"IF(DAY(OFFSET(INDIRECT(ADDRESS(ROW(),COLUMN())),0,-1))>21,BA81+7,IF(DAY(OFFSET(INDIRECT(ADDRESS(ROW(),COLUMN())),0,-1))<7,BA81+0,IF(AND(DAY(OFFSET(INDIRECT(ADDRESS(ROW(),COLUMN())),0,-1))>7,DAY(OFFSET(INDIRECT(ADDRESS(ROW(),COLUMN())),0,-1))<15),BA81+7,BA81+0)))","v":"2029-09-20"},null,"2030-09-17",{"$f":"IF(DAY(OFFSET(INDIRECT(ADDRESS(ROW(),COLUMN())),0,-1))>21,BD81+7,IF(DAY(OFFSET(INDIRECT(ADDRESS(ROW(),COLUMN())),0,-1))<7,BD81+0,IF(AND(DAY(OFFSET(INDIRECT(ADDRESS(ROW(),COLUMN())),0,-1))>7,DAY(OFFSET(INDIRECT(ADDRESS(ROW(),COLUMN())),0,-1))<15),BD81+7,BD81+0)))","v":"2030-09-17"},null,"2027-09-14",null,null,null,null,null,"2029-01-16",{"$f":"IF(DAY(OFFSET(INDIRECT(ADDRESS(ROW(),COLUMN())),0,-1))<15,BM81+7,IF(DAY(OFFSET(INDIRECT(ADDRESS(ROW(),COLUMN())),0,-1))>21,BM81-7,BM81+0))","v":"2029-01-16"},null,"2029-12-25",{"$f":"IF(DAY(OFFSET(INDIRECT(ADDRESS(ROW(),COLUMN())),0,-1))<21,BP81+7,IF(DAY(OFFSET(INDIRECT(ADDRESS(ROW(),COLUMN())),0,-1))>28,BP81-7,BP81+0))","v":"2029-12-25"},null,null,{"$f":"IF(DAY(BT80)=DAY(21),BT80-6,BT80+1)","v":"2028-09-21"},null,"2029-01-16",{"$f":"IF(DAY(OFFSET(INDIRECT(ADDRESS(ROW(),COLUMN())),0,-1))<15,BV81+7,IF(DAY(OFFSET(INDIRECT(ADDRESS(ROW(),COLUMN())),0,-1))>21,BV81-7,BV81+0))","v":"2029-01-16"},null,"2026-09-15",{"$f":"IF(DAY(OFFSET(INDIRECT(ADDRESS(ROW(),COLUMN())),0,-1))>21,BY81+7,IF(DAY(OFFSET(INDIRECT(ADDRESS(ROW(),COLUMN())),0,-1))<7,BY81+0,IF(AND(DAY(OFFSET(INDIRECT(ADDRESS(ROW(),COLUMN())),0,-1))>7,DAY(OFFSET(INDIRECT(ADDRESS(ROW(),COLUMN())),0,-1))<15),BY81+7,BY81+0)))","v":"2026-09-15"},null,"2028-06-20",null,null,null,null,null,"2029-01-04",{"$f":"IF(DAY(OFFSET(INDIRECT(ADDRESS(ROW(),COLUMN())),0,-1))<7,CH81+0,IF(DAY(OFFSET(INDIRECT(ADDRESS(ROW(),COLUMN())),0,-1))>7,CH81-7,CH81+0))","v":"2029-01-04"},null,null,null,null,"2029-01-09",{"$f":"IF(DAY(OFFSET(INDIRECT(ADDRESS(ROW(),COLUMN())),0,-1))<8,CN81+7,CN81+0)","v":"2029-01-09"},null,"2029-01-08",{"$f":"IF(DAY(OFFSET(INDIRECT(ADDRESS(ROW(),COLUMN())),0,-1))<7,CQ81+0,IF(DAY(OFFSET(INDIRECT(ADDRESS(ROW(),COLUMN())),0,-1))>7,CQ81-7,CQ81+0))","v":"2029-01-01"},null,"2031-06-02",{"$f":"IF(DAY(OFFSET(INDIRECT(ADDRESS(ROW(),COLUMN())),0,-1))<7,CT81+0,IF(DAY(OFFSET(INDIRECT(ADDRESS(ROW(),COLUMN())),0,-1))>7,CT81-7,CT81+0))+3","v":"2031-06-05"},null,"2029-01-08",{"$f":"IF(DAY(OFFSET(INDIRECT(ADDRESS(ROW(),COLUMN())),0,-1))<8,CW81+7,CW81+0)","v":"2029-01-08"},null,null,{"$f":"IF(DAY(OFFSET(INDIRECT(ADDRESS(ROW(),COLUMN())),0,-1))<15,CZ81+7,IF(DAY(OFFSET(INDIRECT(ADDRESS(ROW(),COLUMN())),0,-1))>21,CZ81-7,CZ81+0))","v":"1900-01-07"}]
[null,null,null,null,null,"Div 8","City of Archdale",{"$f":"BO40","v":"2028-08-22"},"City of Archdale",0,7,14,null,"2027-07-19",{"$f":"IF(DAY(OFFSET(INDIRECT(ADDRESS(ROW(),COLUMN())),0,-1))>21,N82+7,IF(DAY(OFFSET(INDIRECT(ADDRESS(ROW(),COLUMN())),0,-1))<7,N82+0,IF(AND(DAY(OFFSET(INDIRECT(ADDRESS(ROW(),COLUMN())),0,-1))>7,DAY(OFFSET(INDIRECT(ADDRESS(ROW(),COLUMN())),0,-1))<15),N82+7,N82+0)))","v":"2027-07-19"},null,"2027-07-20",{"$f":"IF(DAY(OFFSET(INDIRECT(ADDRESS(ROW(),COLUMN())),0,-1))>21,Q82+7,IF(DAY(OFFSET(INDIRECT(ADDRESS(ROW(),COLUMN())),0,-1))<7,Q82+0,IF(AND(DAY(OFFSET(INDIRECT(ADDRESS(ROW(),COLUMN())),0,-1))>7,DAY(OFFSET(INDIRECT(ADDRESS(ROW(),COLUMN())),0,-1))<15),Q82+7,Q82+0)))","v":"2027-07-20"},null,"2030-01-08",{"$f":"IF(DAY(OFFSET(INDIRECT(ADDRESS(ROW(),COLUMN())),0,-1))<8,T82+7,T82+0)","v":"2030-01-08"},null,"2027-07-19",{"$f":"IF(DAY(OFFSET(INDIRECT(ADDRESS(ROW(),COLUMN())),0,-1))>21,W82+7,IF(DAY(OFFSET(INDIRECT(ADDRESS(ROW(),COLUMN())),0,-1))<7,W82+0,IF(AND(DAY(OFFSET(INDIRECT(ADDRESS(ROW(),COLUMN())),0,-1))>7,DAY(OFFSET(INDIRECT(ADDRESS(ROW(),COLUMN())),0,-1))<15),W82+7,W82+0)))","v":"2027-07-19"},null,"2030-01-10",null,null,null,null,null,null,null,null,null,null,null,null,null,null,null,null,null,"2030-01-08",{"$f":"IF(DAY(OFFSET(INDIRECT(ADDRESS(ROW(),COLUMN())),0,-1))<8,AR82+7,AR82+0)","v":"2030-01-08"},null,null,{"$f":"IF(DAY(OFFSET(INDIRECT(ADDRESS(ROW(),COLUMN())),0,-1))>21,AU82+7,IF(DAY(OFFSET(INDIRECT(ADDRESS(ROW(),COLUMN())),0,-1))<7,AU82+0,IF(AND(DAY(OFFSET(INDIRECT(ADDRESS(ROW(),COLUMN())),0,-1))>7,DAY(OFFSET(INDIRECT(ADDRESS(ROW(),COLUMN())),0,-1))<15),AU82+7,AU82+0)))","v":"00:00:00"},null,"2030-01-15",{"$f":"IF(DAY(OFFSET(INDIRECT(ADDRESS(ROW(),COLUMN())),0,-1))<16,AX82+7,AX82+0)","v":"2030-01-22"},null,"2027-07-15",{"$f":"IF(DAY(OFFSET(INDIRECT(ADDRESS(ROW(),COLUMN())),0,-1))>21,BA82+7,IF(DAY(OFFSET(INDIRECT(ADDRESS(ROW(),COLUMN())),0,-1))<7,BA82+0,IF(AND(DAY(OFFSET(INDIRECT(ADDRESS(ROW(),COLUMN())),0,-1))>7,DAY(OFFSET(INDIRECT(ADDRESS(ROW(),COLUMN())),0,-1))<15),BA82+7,BA82+0)))","v":"2027-07-15"},null,"2027-07-20",{"$f":"IF(DAY(OFFSET(INDIRECT(ADDRESS(ROW(),COLUMN())),0,-1))>21,BD82+7,IF(DAY(OFFSET(INDIRECT(ADDRESS(ROW(),COLUMN())),0,-1))<7,BD82+0,IF(AND(DAY(OFFSET(INDIRECT(ADDRESS(ROW(),COLUMN())),0,-1))>7,DAY(OFFSET(INDIRECT(ADDRESS(ROW(),COLUMN())),0,-1))<15),BD82+7,BD82+0)))","v":"2027-07-20"},null,null,null,null,null,null,null,"2029-02-20",{"$f":"IF(DAY(OFFSET(INDIRECT(ADDRESS(ROW(),COLUMN())),0,-1))<15,BM82+7,IF(DAY(OFFSET(INDIRECT(ADDRESS(ROW(),COLUMN())),0,-1))>21,BM82-7,BM82+0))","v":"2029-02-20"},null,"2029-12-25",{"$f":"IF(DAY(OFFSET(INDIRECT(ADDRESS(ROW(),COLUMN())),0,-1))<21,BP82+7,IF(DAY(OFFSET(INDIRECT(ADDRESS(ROW(),COLUMN())),0,-1))>28,BP82-7,BP82+0))","v":"2029-12-25"},null,"2028-10-02",{"$f":"IF(DAY(OFFSET(INDIRECT(ADDRESS(ROW(),COLUMN())),0,-1))>21,BS82+7,IF(DAY(OFFSET(INDIRECT(ADDRESS(ROW(),COLUMN())),0,-1))<7,BS82+0,IF(AND(DAY(OFFSET(INDIRECT(ADDRESS(ROW(),COLUMN())),0,-1))>7,DAY(OFFSET(INDIRECT(ADDRESS(ROW(),COLUMN())),0,-1))<15),BS82+7,BS82+0)))","v":"2028-10-02"},null,"2029-02-20",{"$f":"IF(DAY(OFFSET(INDIRECT(ADDRESS(ROW(),COLUMN())),0,-1))<15,BV82+7,IF(DAY(OFFSET(INDIRECT(ADDRESS(ROW(),COLUMN())),0,-1))>21,BV82-7,BV82+0))","v":"2029-02-20"},null,"2027-07-20",{"$f":"IF(DAY(OFFSET(INDIRECT(ADDRESS(ROW(),COLUMN())),0,-1))>21,BY82+7,IF(DAY(OFFSET(INDIRECT(ADDRESS(ROW(),COLUMN())),0,-1))<7,BY82+0,IF(AND(DAY(OFFSET(INDIRECT(ADDRESS(ROW(),COLUMN())),0,-1))>7,DAY(OFFSET(INDIRECT(ADDRESS(ROW(),COLUMN())),0,-1))<15),BY82+7,BY82+0)))","v":"2027-07-20"},null,"2028-07-04",null,null,null,null,null,"2029-02-08",{"$f":"IF(DAY(OFFSET(INDIRECT(ADDRESS(ROW(),COLUMN())),0,-1))<7,CH82+0,IF(DAY(OFFSET(INDIRECT(ADDRESS(ROW(),COLUMN())),0,-1))>7,CH82-7,CH82+0))","v":"2029-02-01"},null,null,null,null,"2030-01-08",{"$f":"IF(DAY(OFFSET(INDIRECT(ADDRESS(ROW(),COLUMN())),0,-1))<8,CN82+7,CN82+0)","v":"2030-01-08"},null,"2030-01-07",{"$f":"IF(DAY(OFFSET(INDIRECT(ADDRESS(ROW(),COLUMN())),0,-1))<7,CQ82+0,IF(DAY(OFFSET(INDIRECT(ADDRESS(ROW(),COLUMN())),0,-1))>7,CQ82-7,CQ82+0))","v":"2030-01-07"},null,"2031-07-07",{"$f":"IF(DAY(OFFSET(INDIRECT(ADDRESS(ROW(),COLUMN())),0,-1))<7,CT82+0,IF(DAY(OFFSET(INDIRECT(ADDRESS(ROW(),COLUMN())),0,-1))>7,CT82-7,CT82+0))+3","v":"2031-07-10"},null,"2030-01-07",{"$f":"IF(DAY(OFFSET(INDIRECT(ADDRESS(ROW(),COLUMN())),0,-1))<8,CW82+7,CW82+0)","v":"2030-01-14"},null,null,{"$f":"IF(DAY(OFFSET(INDIRECT(ADDRESS(ROW(),COLUMN())),0,-1))<15,CZ82+7,IF(DAY(OFFSET(INDIRECT(ADDRESS(ROW(),COLUMN())),0,-1))>21,CZ82-7,CZ82+0))","v":"1900-01-07"}]
[null,null,null,null,null,"Div 8","City of Laurinburg",{"$f":"AW40","v":"2028-08-22"},"City of Laurinburg",7,9,7,null,"2027-08-02",{"$f":"IF(DAY(OFFSET(INDIRECT(ADDRESS(ROW(),COLUMN())),0,-1))>21,N83+7,IF(DAY(OFFSET(INDIRECT(ADDRESS(ROW(),COLUMN())),0,-1))<7,N83+0,IF(AND(DAY(OFFSET(INDIRECT(ADDRESS(ROW(),COLUMN())),0,-1))>7,DAY(OFFSET(INDIRECT(ADDRESS(ROW(),COLUMN())),0,-1))<15),N83+7,N83+0)))","v":"2027-08-02"},null,"2027-08-03",{"$f":"IF(DAY(OFFSET(INDIRECT(ADDRESS(ROW(),COLUMN())),0,-1))>21,Q83+7,IF(DAY(OFFSET(INDIRECT(ADDRESS(ROW(),COLUMN())),0,-1))<7,Q83+0,IF(AND(DAY(OFFSET(INDIRECT(ADDRESS(ROW(),COLUMN())),0,-1))>7,DAY(OFFSET(INDIRECT(ADDRESS(ROW(),COLUMN())),0,-1))<15),Q83+7,Q83+0)))","v":"2027-08-03"},null,null,null,null,"2027-08-02",{"$f":"IF(DAY(OFFSET(INDIRECT(ADDRESS(ROW(),COLUMN())),0,-1))>21,W83+7,IF(DAY(OFFSET(INDIRECT(ADDRESS(ROW(),COLUMN())),0,-1))<7,W83+0,IF(AND(DAY(OFFSET(INDIRECT(ADDRESS(ROW(),COLUMN())),0,-1))>7,DAY(OFFSET(INDIRECT(ADDRESS(ROW(),COLUMN())),0,-1))<15),W83+7,W83+0)))","v":"2027-08-02"},null,null,null,null,null,null,null,null,null,null,null,null,null,null,null,null,null,null,null,null,null,null,null,{"$f":"IF(DAY(OFFSET(INDIRECT(ADDRESS(ROW(),COLUMN())),0,-1))>21,AU83+7,IF(DAY(OFFSET(INDIRECT(ADDRESS(ROW(),COLUMN())),0,-1))<7,AU83+0,IF(AND(DAY(OFFSET(INDIRECT(ADDRESS(ROW(),COLUMN())),0,-1))>7,DAY(OFFSET(INDIRECT(ADDRESS(ROW(),COLUMN())),0,-1))<15),AU83+7,AU83+0)))","v":"00:00:00"},null,null,null,null,"2027-08-05",{"$f":"IF(DAY(OFFSET(INDIRECT(ADDRESS(ROW(),COLUMN())),0,-1))>21,BA83+7,IF(DAY(OFFSET(INDIRECT(ADDRESS(ROW(),COLUMN())),0,-1))<7,BA83+0,IF(AND(DAY(OFFSET(INDIRECT(ADDRESS(ROW(),COLUMN())),0,-1))>7,DAY(OFFSET(INDIRECT(ADDRESS(ROW(),COLUMN())),0,-1))<15),BA83+7,BA83+0)))","v":"2027-08-05"},null,"2027-08-02",{"$f":"IF(DAY(OFFSET(INDIRECT(ADDRESS(ROW(),COLUMN())),0,-1))>21,BD83+7,IF(DAY(OFFSET(INDIRECT(ADDRESS(ROW(),COLUMN())),0,-1))<7,BD83+0,IF(AND(DAY(OFFSET(INDIRECT(ADDRESS(ROW(),COLUMN())),0,-1))>7,DAY(OFFSET(INDIRECT(ADDRESS(ROW(),COLUMN())),0,-1))<15),BD83+7,BD83+0)))","v":"2027-08-02"},null,null,null,null,null,null,null,"2029-03-20",{"$f":"IF(DAY(OFFSET(INDIRECT(ADDRESS(ROW(),COLUMN())),0,-1))<15,BM83+7,IF(DAY(OFFSET(INDIRECT(ADDRESS(ROW(),COLUMN())),0,-1))>21,BM83-7,BM83+0))","v":"2029-03-20"},null,"2030-02-19",null,null,"2028-10-16",{"$f":"IF((DAY(BS83))<DAY(13),BS83+10,IF((DAY(BS83))>=DAY(20),BS83-5,BS83+2))","v":"2028-10-18"},null,"2029-03-20",{"$f":"IF(DAY(OFFSET(INDIRECT(ADDRESS(ROW(),COLUMN())),0,-1))<15,BV83+7,IF(DAY(OFFSET(INDIRECT(ADDRESS(ROW(),COLUMN())),0,-1))>21,BV83-7,BV83+0))","v":"2029-03-20"},null,"2027-08-03",{"$f":"IF(DAY(OFFSET(INDIRECT(ADDRESS(ROW(),COLUMN())),0,-1))>21,BY83+7,IF(DAY(OFFSET(INDIRECT(ADDRESS(ROW(),COLUMN())),0,-1))<7,BY83+0,IF(AND(DAY(OFFSET(INDIRECT(ADDRESS(ROW(),COLUMN())),0,-1))>7,DAY(OFFSET(INDIRECT(ADDRESS(ROW(),COLUMN())),0,-1))<15),BY83+7,BY83+0)))","v":"2027-08-03"},null,"2028-07-18",null,null,null,null,null,"2029-03-08",{"$f":"IF(DAY(OFFSET(INDIRECT(ADDRESS(ROW(),COLUMN())),0,-1))<7,CH83+0,IF(DAY(OFFSET(INDIRECT(ADDRESS(ROW(),COLUMN())),0,-1))>7,CH83-7,CH83+0))","v":"2029-03-01"},null,null,null,null,null,null,null,null,null,null,"2031-08-04",null,null,null,null,null,null,{"$f":"IF(DAY(OFFSET(INDIRECT(ADDRESS(ROW(),COLUMN())),0,-1))<15,CZ83+7,IF(DAY(OFFSET(INDIRECT(ADDRESS(ROW(),COLUMN())),0,-1))>21,CZ83-7,CZ83+0))","v":"1900-01-07"}]
[null,null,null,null,null,"Div 8","City of Sanford",{"$f":"P40","v":"2028-08-15"},"City of Sanford",0,14,7,null,"2027-08-16",{"$f":"IF(DAY(OFFSET(INDIRECT(ADDRESS(ROW(),COLUMN())),0,-1))>21,N84+7,IF(DAY(OFFSET(INDIRECT(ADDRESS(ROW(),COLUMN())),0,-1))<7,N84+0,IF(AND(DAY(OFFSET(INDIRECT(ADDRESS(ROW(),COLUMN())),0,-1))>7,DAY(OFFSET(INDIRECT(ADDRESS(ROW(),COLUMN())),0,-1))<15),N84+7,N84+0)))","v":"2027-08-16"},null,"2027-08-17",{"$f":"IF(DAY(OFFSET(INDIRECT(ADDRESS(ROW(),COLUMN())),0,-1))>21,Q84+7,IF(DAY(OFFSET(INDIRECT(ADDRESS(ROW(),COLUMN())),0,-1))<7,Q84+0,IF(AND(DAY(OFFSET(INDIRECT(ADDRESS(ROW(),COLUMN())),0,-1))>7,DAY(OFFSET(INDIRECT(ADDRESS(ROW(),COLUMN())),0,-1))<15),Q84+7,Q84+0)))","v":"2027-08-17"},null,null,null,null,"2027-08-16",{"$f":"IF(DAY(OFFSET(INDIRECT(ADDRESS(ROW(),COLUMN())),0,-1))>21,W84+7,IF(DAY(OFFSET(INDIRECT(ADDRESS(ROW(),COLUMN())),0,-1))<7,W84+0,IF(AND(DAY(OFFSET(INDIRECT(ADDRESS(ROW(),COLUMN())),0,-1))>7,DAY(OFFSET(INDIRECT(ADDRESS(ROW(),COLUMN())),0,-1))<15),W84+7,W84+0)))","v":"2027-08-16"},null,null,null,null,null,null,null,null,null,null,null,null,null,null,null,null,null,null,null,null,null,null,null,{"$f":"IF(DAY(OFFSET(INDIRECT(ADDRESS(ROW(),COLUMN())),0,-1))>21,AU84+7,IF(DAY(OFFSET(INDIRECT(ADDRESS(ROW(),COLUMN())),0,-1))<7,AU84+0,IF(AND(DAY(OFFSET(INDIRECT(ADDRESS(ROW(),COLUMN())),0,-1))>7,DAY(OFFSET(INDIRECT(ADDRESS(ROW(),COLUMN())),0,-1))<15),AU84+7,AU84+0)))","v":"00:00:00"},null,null,null,null,"2027-08-19",{"$f":"IF(DAY(OFFSET(INDIRECT(ADDRESS(ROW(),COLUMN())),0,-1))>21,BA84+7,IF(DAY(OFFSET(INDIRECT(ADDRESS(ROW(),COLUMN())),0,-1))<7,BA84+0,IF(AND(DAY(OFFSET(INDIRECT(ADDRESS(ROW(),COLUMN())),0,-1))>7,DAY(OFFSET(INDIRECT(ADDRESS(ROW(),COLUMN())),0,-1))<15),BA84+7,BA84+0)))","v":"2027-08-19"},null,"2027-08-17",{"$f":"IF(DAY(OFFSET(INDIRECT(ADDRESS(ROW(),COLUMN())),0,-1))>21,BD84+7,IF(DAY(OFFSET(INDIRECT(ADDRESS(ROW(),COLUMN())),0,-1))<7,BD84+0,IF(AND(DAY(OFFSET(INDIRECT(ADDRESS(ROW(),COLUMN())),0,-1))>7,DAY(OFFSET(INDIRECT(ADDRESS(ROW(),COLUMN())),0,-1))<15),BD84+7,BD84+0)))","v":"2027-08-17"},null,null,null,null,null,null,null,"2030-03-19",{"$f":"IF(DAY(OFFSET(INDIRECT(ADDRESS(ROW(),COLUMN())),0,-1))<15,BM84+7,IF(DAY(OFFSET(INDIRECT(ADDRESS(ROW(),COLUMN())),0,-1))>21,BM84-7,BM84+0))","v":"2030-03-19"},null,"2030-03-19",null,null,null,{"$f":"IF(DAY(BT83)=DAY(21),BT83-6,BT83+1)","v":"2028-10-19"},null,"2029-04-17",{"$f":"IF(DAY(OFFSET(INDIRECT(ADDRESS(ROW(),COLUMN())),0,-1))<15,BV84+7,IF(DAY(OFFSET(INDIRECT(ADDRESS(ROW(),COLUMN())),0,-1))>21,BV84-7,BV84+0))","v":"2029-04-17"},null,"2027-08-17",{"$f":"IF(DAY(OFFSET(INDIRECT(ADDRESS(ROW(),COLUMN())),0,-1))>21,BY84+7,IF(DAY(OFFSET(INDIRECT(ADDRESS(ROW(),COLUMN())),0,-1))<7,BY84+0,IF(AND(DAY(OFFSET(INDIRECT(ADDRESS(ROW(),COLUMN())),0,-1))>7,DAY(OFFSET(INDIRECT(ADDRESS(ROW(),COLUMN())),0,-1))<15),BY84+7,BY84+0)))","v":"2027-08-17"},null,"2028-08-01",null,null,null,null,null,"2030-03-07",{"$f":"IF(DAY(OFFSET(INDIRECT(ADDRESS(ROW(),COLUMN())),0,-1))<7,CH84+0,IF(DAY(OFFSET(INDIRECT(ADDRESS(ROW(),COLUMN())),0,-1))>7,CH84-7,CH84+0))","v":"2030-03-07"},null,null,null,null,null,null,null,null,null,null,"2031-09-08"]
[null,null,null,null,null,"Div 8","Town of Southern Pines",{"$f":"S40","v":"2028-08-15"},"Town of Southern Pines",14,6,14,null,"2027-08-30",{"$f":"IF(DAY(OFFSET(INDIRECT(ADDRESS(ROW(),COLUMN())),0,-1))>21,N85+7,IF(DAY(OFFSET(INDIRECT(ADDRESS(ROW(),COLUMN())),0,-1))<7,N85+0,IF(AND(DAY(OFFSET(INDIRECT(ADDRESS(ROW(),COLUMN())),0,-1))>7,DAY(OFFSET(INDIRECT(ADDRESS(ROW(),COLUMN())),0,-1))<15),N85+7,N85+0)))","v":"2027-09-06"},null,"2027-09-07",{"$f":"IF(DAY(OFFSET(INDIRECT(ADDRESS(ROW(),COLUMN())),0,-1))>21,Q85+7,IF(DAY(OFFSET(INDIRECT(ADDRESS(ROW(),COLUMN())),0,-1))<7,Q85+0,IF(AND(DAY(OFFSET(INDIRECT(ADDRESS(ROW(),COLUMN())),0,-1))>7,DAY(OFFSET(INDIRECT(ADDRESS(ROW(),COLUMN())),0,-1))<15),Q85+7,Q85+0)))","v":"2027-09-07"},null,null,null,null,"2027-08-30",{"$f":"IF(DAY(OFFSET(INDIRECT(ADDRESS(ROW(),COLUMN())),0,-1))>21,W85+7,IF(DAY(OFFSET(INDIRECT(ADDRESS(ROW(),COLUMN())),0,-1))<7,W85+0,IF(AND(DAY(OFFSET(INDIRECT(ADDRESS(ROW(),COLUMN())),0,-1))>7,DAY(OFFSET(INDIRECT(ADDRESS(ROW(),COLUMN())),0,-1))<15),W85+7,W85+0)))","v":"2027-09-06"},null,null,null,null,null,null,null,null,null,null,null,null,null,null,null,null,null,null,null,null,null,null,null,{"$f":"IF(DAY(OFFSET(INDIRECT(ADDRESS(ROW(),COLUMN())),0,-1))>21,AU85+7,IF(DAY(OFFSET(INDIRECT(ADDRESS(ROW(),COLUMN())),0,-1))<7,AU85+0,IF(AND(DAY(OFFSET(INDIRECT(ADDRESS(ROW(),COLUMN())),0,-1))>7,DAY(OFFSET(INDIRECT(ADDRESS(ROW(),COLUMN())),0,-1))<15),AU85+7,AU85+0)))","v":"00:00:00"},null,null,null,null,"2027-09-02",{"$f":"IF(DAY(OFFSET(INDIRECT(ADDRESS(ROW(),COLUMN())),0,-1))>21,BA85+7,IF(DAY(OFFSET(INDIRECT(ADDRESS(ROW(),COLUMN())),0,-1))<7,BA85+0,IF(AND(DAY(OFFSET(INDIRECT(ADDRESS(ROW(),COLUMN())),0,-1))>7,DAY(OFFSET(INDIRECT(ADDRESS(ROW(),COLUMN())),0,-1))<15),BA85+7,BA85+0)))","v":"2027-09-02"},null,"2027-08-30",{"$f":"IF(DAY(OFFSET(INDIRECT(ADDRESS(ROW(),COLUMN())),0,-1))>21,BD85+7,IF(DAY(OFFSET(INDIRECT(ADDRESS(ROW(),COLUMN())),0,-1))<7,BD85+0,IF(AND(DAY(OFFSET(INDIRECT(ADDRESS(ROW(),COLUMN())),0,-1))>7,DAY(OFFSET(INDIRECT(ADDRESS(ROW(),COLUMN())),0,-1))<15),BD85+7,BD85+0)))","v":"2027-09-06"},null,null,null,null,null,null,null,null,null,null,null,null,null,"2028-10-30",{"$f":"IF(DAY(OFFSET(INDIRECT(ADDRESS(ROW(),COLUMN())),0,-1))>21,BS85+7,IF(DAY(OFFSET(INDIRECT(ADDRESS(ROW(),COLUMN())),0,-1))<7,BS85+0,IF(AND(DAY(OFFSET(INDIRECT(ADDRESS(ROW(),COLUMN())),0,-1))>7,DAY(OFFSET(INDIRECT(ADDRESS(ROW(),COLUMN())),0,-1))<15),BS85+7,BS85+0)))","v":"2028-11-06"},null,"2029-05-22",null,null,"2027-09-07",{"$f":"IF(DAY(OFFSET(INDIRECT(ADDRESS(ROW(),COLUMN())),0,-1))>21,BY85+7,IF(DAY(OFFSET(INDIRECT(ADDRESS(ROW(),COLUMN())),0,-1))<7,BY85+0,IF(AND(DAY(OFFSET(INDIRECT(ADDRESS(ROW(),COLUMN())),0,-1))>7,DAY(OFFSET(INDIRECT(ADDRESS(ROW(),COLUMN())),0,-1))<15),BY85+7,BY85+0)))","v":"2027-09-07"},null,"2028-08-15",null,null,null,null,null,null,null,null,null,null,null,null,null,null,null,null,null,"2031-10-06"]
[null,null,null,null,null,"Div 8","City of Asheboro",{"$f":"CS40","v":"2028-08-10"},"City of Asheboro",0,7,45,null,"2028-09-04",{"$f":"IF(DAY(OFFSET(INDIRECT(ADDRESS(ROW(),COLUMN())),0,-1))>21,N86+7,IF(DAY(OFFSET(INDIRECT(ADDRESS(ROW(),COLUMN())),0,-1))<7,N86+0,IF(AND(DAY(OFFSET(INDIRECT(ADDRESS(ROW(),COLUMN())),0,-1))>7,DAY(OFFSET(INDIRECT(ADDRESS(ROW(),COLUMN())),0,-1))<15),N86+7,N86+0)))","v":"2028-09-04"},null,"3800-09-16",{"$f":"IF(DAY(OFFSET(INDIRECT(ADDRESS(ROW(),COLUMN())),0,-1))>21,Q86+7,IF(DAY(OFFSET(INDIRECT(ADDRESS(ROW(),COLUMN())),0,-1))<7,Q86+0,IF(AND(DAY(OFFSET(INDIRECT(ADDRESS(ROW(),COLUMN())),0,-1))>7,DAY(OFFSET(INDIRECT(ADDRESS(ROW(),COLUMN())),0,-1))<15),Q86+7,Q86+0)))","v":"3800-09-16"},null,null,null,null,"2027-09-13",{"$f":"IF(DAY(OFFSET(INDIRECT(ADDRESS(ROW(),COLUMN())),0,-1))>21,W86+7,IF(DAY(OFFSET(INDIRECT(ADDRESS(ROW(),COLUMN())),0,-1))<7,W86+0,IF(AND(DAY(OFFSET(INDIRECT(ADDRESS(ROW(),COLUMN())),0,-1))>7,DAY(OFFSET(INDIRECT(ADDRESS(ROW(),COLUMN())),0,-1))<15),W86+7,W86+0)))","v":"2027-09-20"},null,null,null,null,null,null,null,null,null,null,null,null,null,null,null,null,null,null,null,null,null,null,null,{"$f":"IF(DAY(OFFSET(INDIRECT(ADDRESS(ROW(),COLUMN())),0,-1))>21,AU86+7,IF(DAY(OFFSET(INDIRECT(ADDRESS(ROW(),COLUMN())),0,-1))<7,AU86+0,IF(AND(DAY(OFFSET(INDIRECT(ADDRESS(ROW(),COLUMN())),0,-1))>7,DAY(OFFSET(INDIRECT(ADDRESS(ROW(),COLUMN())),0,-1))<15),AU86+7,AU86+0)))","v":"00:00:00"},null,null,null,null,"2027-09-16",{"$f":"IF(DAY(OFFSET(INDIRECT(ADDRESS(ROW(),COLUMN())),0,-1))>21,BA86+7,IF(DAY(OFFSET(INDIRECT(ADDRESS(ROW(),COLUMN())),0,-1))<7,BA86+0,IF(AND(DAY(OFFSET(INDIRECT(ADDRESS(ROW(),COLUMN())),0,-1))>7,DAY(OFFSET(INDIRECT(ADDRESS(ROW(),COLUMN())),0,-1))<15),BA86+7,BA86+0)))","v":"2027-09-16"},null,"3800-09-16",{"$f":"IF(DAY(OFFSET(INDIRECT(ADDRESS(ROW(),COLUMN())),0,-1))>21,BD86+7,IF(DAY(OFFSET(INDIRECT(ADDRESS(ROW(),COLUMN())),0,-1))<7,BD86+0,IF(AND(DAY(OFFSET(INDIRECT(ADDRESS(ROW(),COLUMN())),0,-1))>7,DAY(OFFSET(INDIRECT(ADDRESS(ROW(),COLUMN())),0,-1))<15),BD86+7,BD86+0)))","v":"3800-09-16"},null,null,null,null,null,null,null,null,null,null,null,null,null,"2028-11-20",{"$f":"IF((DAY(BS86))<DAY(13),BS86+10,IF((DAY(BS86))>=DAY(20),BS86-5,BS86+2))","v":"2028-11-15"},null,"2030-05-21",null,null,"3800-09-16",{"$f":"IF(DAY(OFFSET(INDIRECT(ADDRESS(ROW(),COLUMN())),0,-1))>21,BY86+7,IF(DAY(OFFSET(INDIRECT(ADDRESS(ROW(),COLUMN())),0,-1))<7,BY86+0,IF(AND(DAY(OFFSET(INDIRECT(ADDRESS(ROW(),COLUMN())),0,-1))>7,DAY(OFFSET(INDIRECT(ADDRESS(ROW(),COLUMN())),0,-1))<15),BY86+7,BY86+0)))","v":"3800-09-16"},null,"2028-09-05"]
[null,null,null,null,null,"Div 8","City of Pinehurst",{"$f":"P40","v":"2028-08-15"},"City of Pinehurst",0,12,10,null,null,null,null,"2026-09-15",null,null,null,null,null,"2027-09-13",{"$f":"IF(DAY(OFFSET(INDIRECT(ADDRESS(ROW(),COLUMN())),0,-1))>21,W87+7,IF(DAY(OFFSET(INDIRECT(ADDRESS(ROW(),COLUMN())),0,-1))<7,W87+0,IF(AND(DAY(OFFSET(INDIRECT(ADDRESS(ROW(),COLUMN())),0,-1))>7,DAY(OFFSET(INDIRECT(ADDRESS(ROW(),COLUMN())),0,-1))<15),W87+7,W87+0)))","v":"2027-09-20"},null,null,null,null,null,null,null,null,null,null,null,null,null,null,null,null,null,null,null,null,null,null,null,{"$f":"IF(DAY(OFFSET(INDIRECT(ADDRESS(ROW(),COLUMN())),0,-1))>21,AU87+7,IF(DAY(OFFSET(INDIRECT(ADDRESS(ROW(),COLUMN())),0,-1))<7,AU87+0,IF(AND(DAY(OFFSET(INDIRECT(ADDRESS(ROW(),COLUMN())),0,-1))>7,DAY(OFFSET(INDIRECT(ADDRESS(ROW(),COLUMN())),0,-1))<15),AU87+7,AU87+0)))","v":"00:00:00"},null,null,null,null,"2028-09-14",{"$f":"IF(DAY(OFFSET(INDIRECT(ADDRESS(ROW(),COLUMN())),0,-1))>21,BA87+7,IF(DAY(OFFSET(INDIRECT(ADDRESS(ROW(),COLUMN())),0,-1))<7,BA87+0,IF(AND(DAY(OFFSET(INDIRECT(ADDRESS(ROW(),COLUMN())),0,-1))>7,DAY(OFFSET(INDIRECT(ADDRESS(ROW(),COLUMN())),0,-1))<15),BA87+7,BA87+0)))","v":"2028-09-21"},null,null,{"$f":"IF(DAY(OFFSET(INDIRECT(ADDRESS(ROW(),COLUMN())),0,-1))>21,BD87+7,IF(DAY(OFFSET(INDIRECT(ADDRESS(ROW(),COLUMN())),0,-1))<7,BD87+0,IF(AND(DAY(OFFSET(INDIRECT(ADDRESS(ROW(),COLUMN())),0,-1))>7,DAY(OFFSET(INDIRECT(ADDRESS(ROW(),COLUMN())),0,-1))<15),BD87+7,BD87+0)))","v":"00:00:00"},null,null,null,null,null,null,null,null,null,null,null,null,null,null,{"$f":"IF(DAY(BT86)=DAY(21),BT86-6,BT86+1)","v":"2028-11-16"},null,null,null,null,"2026-09-15"]
[null,null,null,null,null,"Div 7 ","City of Archdale",{"$f":"BO40","v":"2028-08-22"},"City of Archdale",0,7,14,null,null,null,null,null,null,null,null,null,null,null,null,null,null,null,null,null,null,null,null,null,null,null,null,null,null,null,null,null,null,null,null,null,null,null,null,null,null,null,null,null,null,null,null,{"$f":"IF(DAY(OFFSET(INDIRECT(ADDRESS(ROW(),COLUMN())),0,-1))>21,BD88+7,IF(DAY(OFFSET(INDIRECT(ADDRESS(ROW(),COLUMN())),0,-1))<7,BD88+0,IF(AND(DAY(OFFSET(INDIRECT(ADDRESS(ROW(),COLUMN())),0,-1))>7,DAY(OFFSET(INDIRECT(ADDRESS(ROW(),COLUMN())),0,-1))<15),BD88+7,BD88+0)))","v":"00:00:00"},null,null,null,null,null,null,null,null,null,null,null,null,null,"2028-12-04",{"$f":"IF(DAY(OFFSET(INDIRECT(ADDRESS(ROW(),COLUMN())),0,-1))>21,BS88+7,IF(DAY(OFFSET(INDIRECT(ADDRESS(ROW(),COLUMN())),0,-1))<7,BS88+0,IF(AND(DAY(OFFSET(INDIRECT(ADDRESS(ROW(),COLUMN())),0,-1))>7,DAY(OFFSET(INDIRECT(ADDRESS(ROW(),COLUMN())),0,-1))<15),BS88+7,BS88+0)))","v":"2028-12-04"},null,"2027-10-04"]
[null,null,null,null,null,"Div 7 ","City of High Point",{"$f":"M40","v":"2028-08-21"},"City of High Point",0,7,14,null,null,null,null,null,null,null,null,null,null,null,null,null,null,null,null,null,null,null,null,null,null,null,null,null,null,null,null,null,null,null,null,null,null,null,null,null,null,null,null,null,null,null,null,{"$f":"IF(DAY(OFFSET(INDIRECT(ADDRESS(ROW(),COLUMN())),0,-1))>21,BD89+7,IF(DAY(OFFSET(INDIRECT(ADDRESS(ROW(),COLUMN())),0,-1))<7,BD89+0,IF(AND(DAY(OFFSET(INDIRECT(ADDRESS(ROW(),COLUMN())),0,-1))>7,DAY(OFFSET(INDIRECT(ADDRESS(ROW(),COLUMN())),0,-1))<15),BD89+7,BD89+0)))","v":"00:00:00"},null,null,null,null,null,null,null,null,null,null,null,null,null,"2028-12-18",{"$f":"IF((DAY(BS89))<DAY(13),BS89+10,IF((DAY(BS89))>=DAY(20),BS89-5,BS89+2))","v":"2028-12-20"},null,"2027-10-18"]
[null,null,null,null,null,"Div 7","City of Burlington",{"$f":"P40","v":"2028-08-15"},"City of Burlington",30,7,7,null,null,null,null,null,null,null,null,null,null,null,null,null,null,null,null,null,null,null,null,null,null,null,null,null,null,null,null,null,null,null,null,null,null,null,null,null,null,null,null,null,null,null,null,{"$f":"IF(DAY(OFFSET(INDIRECT(ADDRESS(ROW(),COLUMN())),0,-1))>21,BD90+7,IF(DAY(OFFSET(INDIRECT(ADDRESS(ROW(),COLUMN())),0,-1))<7,BD90+0,IF(AND(DAY(OFFSET(INDIRECT(ADDRESS(ROW(),COLUMN())),0,-1))>7,DAY(OFFSET(INDIRECT(ADDRESS(ROW(),COLUMN())),0,-1))<15),BD90+7,BD90+0)))","v":"00:00:00"},null,null,null,null,null,null,null,null,null,null,null,null,null,null,{"$f":"IF(DAY(BT89)=DAY(21),BT89-6,BT89+1)","v":"2028-12-21"}]
[null,null,null,null,null,"Div 7","City of Graham",{"$f":"S40","v":"2028-08-15"},"City of Graham",0,7,30,null,null,null,null,null,null,null,null,null,null,null,null,null,null,null,null,null,null,null,null,null,null,null,null,null,null,null,null,null,null,null,null,null,null,null,null,null,null,null,null,null,null,null,null,{"$f":"IF(DAY(OFFSET(INDIRECT(ADDRESS(ROW(),COLUMN())),0,-1))>21,BD91+7,IF(DAY(OFFSET(INDIRECT(ADDRESS(ROW(),COLUMN())),0,-1))<7,BD91+0,IF(AND(DAY(OFFSET(INDIRECT(ADDRESS(ROW(),COLUMN())),0,-1))>7,DAY(OFFSET(INDIRECT(ADDRESS(ROW(),COLUMN())),0,-1))<15),BD91+7,BD91+0)))","v":"00:00:00"},null,null,null,null,null,null,null,null,null,null,null,null,null,"2029-01-01",{"$f":"IF(DAY(OFFSET(INDIRECT(ADDRESS(ROW(),COLUMN())),0,-1))>21,BS91+7,IF(DAY(OFFSET(INDIRECT(ADDRESS(ROW(),COLUMN())),0,-1))<7,BS91+0,IF(AND(DAY(OFFSET(INDIRECT(ADDRESS(ROW(),COLUMN())),0,-1))>7,DAY(OFFSET(INDIRECT(ADDRESS(ROW(),COLUMN())),0,-1))<15),BS91+7,BS91+0)))","v":"2029-01-01"},null,"2027-11-01"]
[null,null,null,null,null,"Div 7","Town of Eden",{"$f":"BL40","v":"2028-08-15"},"Town of Eden",0,5,5,null,null,null,null,null,null,null,null,null,null,null,null,null,null,null,null,null,null,null,null,null,null,null,null,null,null,null,null,null,null,null,null,null,null,null,null,null,null,null,null,null,null,null,null,{"$f":"IF(DAY(OFFSET(INDIRECT(ADDRESS(ROW(),COLUMN())),0,-1))>21,BD92+7,IF(DAY(OFFSET(INDIRECT(ADDRESS(ROW(),COLUMN())),0,-1))<7,BD92+0,IF(AND(DAY(OFFSET(INDIRECT(ADDRESS(ROW(),COLUMN())),0,-1))>7,DAY(OFFSET(INDIRECT(ADDRESS(ROW(),COLUMN())),0,-1))<15),BD92+7,BD92+0)))","v":"00:00:00"},null,null,null,null,null,null,null,null,null,null,null,null,null,"2029-01-15",{"$f":"IF((DAY(BS92))<DAY(13),BS92+10,IF((DAY(BS92))>=DAY(20),BS92-5,BS92+2))","v":"2029-01-17"},null,"2027-11-15"]
[null,null,null,null,null,"Div 7","Town of Summerfield",{"$f":"S40","v":"2028-08-15"},"Town of Summerfield",0,8,14,null,null,null,null,null,null,null,null,null,null,null,null,null,null,null,null,null,null,null,null,null,null,null,null,null,null,null,null,null,null,null,null,null,null,null,null,null,null,null,null,null,null,null,null,{"$f":"IF(DAY(OFFSET(INDIRECT(ADDRESS(ROW(),COLUMN())),0,-1))>21,BD93+7,IF(DAY(OFFSET(INDIRECT(ADDRESS(ROW(),COLUMN())),0,-1))<7,BD93+0,IF(AND(DAY(OFFSET(INDIRECT(ADDRESS(ROW(),COLUMN())),0,-1))>7,DAY(OFFSET(INDIRECT(ADDRESS(ROW(),COLUMN())),0,-1))<15),BD93+7,BD93+0)))","v":"00:00:00"},null,null,null,null,null,null,null,null,null,null,null,null,null,null,{"$f":"IF(DAY(BT92)=DAY(21),BT92-6,BT92+1)","v":"2029-01-18"}]
[null,null,null,null,null,"Div 7","City of Chapel Hill(OWASA)",{"$f":"BC40","v":"2028-08-15"},"City of Chapel Hill(OWASA)",0,0,30,null,null,null,null,null,null,null,null,null,null,null,null,null,null,null,null,null,null,null,null,null,null,null,null,null,null,null,null,null,null,null,null,null,null,null,null,null,null,null,null,null,null,null,null,{"$f":"IF(DAY(OFFSET(INDIRECT(ADDRESS(ROW(),COLUMN())),0,-1))>21,BD94+7,IF(DAY(OFFSET(INDIRECT(ADDRESS(ROW(),COLUMN())),0,-1))<7,BD94+0,IF(AND(DAY(OFFSET(INDIRECT(ADDRESS(ROW(),COLUMN())),0,-1))>7,DAY(OFFSET(INDIRECT(ADDRESS(ROW(),COLUMN())),0,-1))<15),BD94+7,BD94+0)))","v":"00:00:00"},null,null,null,null,null,null,null,null,null,null,null,null,null,"2029-02-05",{"$f":"IF(DAY(OFFSET(INDIRECT(ADDRESS(ROW(),COLUMN())),0,-1))>21,BS94+7,IF(DAY(OFFSET(INDIRECT(ADDRESS(ROW(),COLUMN())),0,-1))<7,BS94+0,IF(AND(DAY(OFFSET(INDIRECT(ADDRESS(ROW(),COLUMN())),0,-1))>7,DAY(OFFSET(INDIRECT(ADDRESS(ROW(),COLUMN())),0,-1))<15),BS94+7,BS94+0)))","v":"2029-02-05"},null,"2027-11-29"]
[null,null,null,null,null,"Div 7","City of Greensboro",{"$f":"BL40","v":"2028-08-15"},"City of Greensboro",0,1,21,null,null,null,null,null,null,null,null,null,null,null,null,null,null,null,null,null,null,null,null,null,null,null,null,null,null,null,null,null,null,null,null,null,null,null,null,null,null,null,null,null,null,null,null,{"$f":"IF(DAY(OFFSET(INDIRECT(ADDRESS(ROW(),COLUMN())),0,-1))>21,BD95+7,IF(DAY(OFFSET(INDIRECT(ADDRESS(ROW(),COLUMN())),0,-1))<7,BD95+0,IF(AND(DAY(OFFSET(INDIRECT(ADDRESS(ROW(),COLUMN())),0,-1))>7,DAY(OFFSET(INDIRECT(ADDRESS(ROW(),COLUMN())),0,-1))<15),BD95+7,BD95+0)))","v":"00:00:00"},null,null,null,null,null,null,null,null,null,null,null,null,null,"2029-02-19",{"$f":"IF((DAY(BS95))<DAY(13),BS95+10,IF((DAY(BS95))>=DAY(20),BS95-5,BS95+2))","v":"2029-02-21"},null,"2027-12-20"]
[null,null,null,null,null,"Div 7","City of Mebane",{"$f":"CP40","v":"2028-09-04"},"City of Mebane",0,5,5,null,null,null,null,null,null,null,null,null,null,null,null,null,null,null,null,null,null,null,null,null,null,null,null,null,null,null,null,null,null,null,null,null,null,null,null,null,null,null,null,null,null,null,null,{"$f":"IF(DAY(OFFSET(INDIRECT(ADDRESS(ROW(),COLUMN())),0,-1))>21,BD96+7,IF(DAY(OFFSET(INDIRECT(ADDRESS(ROW(),COLUMN())),0,-1))<7,BD96+0,IF(AND(DAY(OFFSET(INDIRECT(ADDRESS(ROW(),COLUMN())),0,-1))>7,DAY(OFFSET(INDIRECT(ADDRESS(ROW(),COLUMN())),0,-1))<15),BD96+7,BD96+0)))","v":"00:00:00"},null,null,null,null,null,null,null,null,null,null,null,null,null,null,{"$f":"IF(DAY(BT95)=DAY(21),BT95-6,BT95+1)","v":"2029-02-15"}]
[null,null,null,null,null,"Div 7","Town of Elon",{"$f":"AK35","v":"2028-08-28"},"Town of Elon",0,7,21,null,null,null,null,null,null,null,null,null,null,null,null,null,null,null,null,null,null,null,null,null,null,null,null,null,null,null,null,null,null,null,null,null,null,null,null,null,null,null,null,null,null,null,null,{"$f":"IF(DAY(OFFSET(INDIRECT(ADDRESS(ROW(),COLUMN())),0,-1))>21,BD97+7,IF(DAY(OFFSET(INDIRECT(ADDRESS(ROW(),COLUMN())),0,-1))<7,BD97+0,IF(AND(DAY(OFFSET(INDIRECT(ADDRESS(ROW(),COLUMN())),0,-1))>7,DAY(OFFSET(INDIRECT(ADDRESS(ROW(),COLUMN())),0,-1))<15),BD97+7,BD97+0)))","v":"00:00:00"},null,null,null,null,null,null,null,null,null,null,null,null,null,"2029-03-05",{"$f":"IF(DAY(OFFSET(INDIRECT(ADDRESS(ROW(),COLUMN())),0,-1))>21,BS97+7,IF(DAY(OFFSET(INDIRECT(ADDRESS(ROW(),COLUMN())),0,-1))<7,BS97+0,IF(AND(DAY(OFFSET(INDIRECT(ADDRESS(ROW(),COLUMN())),0,-1))>7,DAY(OFFSET(INDIRECT(ADDRESS(ROW(),COLUMN())),0,-1))<15),BS97+7,BS97+0)))","v":"2029-03-05"},null,"2028-01-03"]
[null,null,null,null,null,"Div 7","City of Carrboro",null,"City of Carrboro",0,14,7,null,null,null,null,null,null,null,null,null,null,null,null,null,null,null,null,null,null,null,null,null,null,null,null,null,null,null,null,null,null,null,null,null,null,null,null,null,null,null,null,null,null,null,null,{"$f":"IF(DAY(OFFSET(INDIRECT(ADDRESS(ROW(),COLUMN())),0,-1))>21,BD98+7,IF(DAY(OFFSET(INDIRECT(ADDRESS(ROW(),COLUMN())),0,-1))<7,BD98+0,IF(AND(DAY(OFFSET(INDIRECT(ADDRESS(ROW(),COLUMN())),0,-1))>7,DAY(OFFSET(INDIRECT(ADDRESS(ROW(),COLUMN())),0,-1))<15),BD98+7,BD98+0)))","v":"00:00:00"},null,null,null,null,null,null,null,null,null,null,null,null,null,"2029-03-19",{"$f":"IF((DAY(BS98))<DAY(13),BS98+10,IF((DAY(BS98))>=DAY(20),BS98-5,BS98+2))","v":"2029-03-21"},null,"2028-01-17"]
[null,null,null,null,null,"Div 7","Town of Reidsville",{"$f":"S40","v":"2028-08-15"},"Town of Reidsville",10,14,45,null,null,null,null,null,null,null,null,null,null,null,null,null,null,null,null,null,null,null,null,null,null,null,null,null,null,null,null,null,null,null,null,null,null,null,null,null,null,null,null,null,null,null,null,{"$f":"IF(DAY(OFFSET(INDIRECT(ADDRESS(ROW(),COLUMN())),0,-1))>21,BD99+7,IF(DAY(OFFSET(INDIRECT(ADDRESS(ROW(),COLUMN())),0,-1))<7,BD99+0,IF(AND(DAY(OFFSET(INDIRECT(ADDRESS(ROW(),COLUMN())),0,-1))>7,DAY(OFFSET(INDIRECT(ADDRESS(ROW(),COLUMN())),0,-1))<15),BD99+7,BD99+0)))","v":"00:00:00"},null,null,null,null,null,null,null,null,null,null,null,null,null,null,{"$f":"IF(DAY(BT98)=DAY(21),BT98-6,BT98+1)","v":"2029-03-15"}]
[null,null,null,null,null,"Div 6","City of Fayetville",{"$f":"BF40","v":"2028-08-09"},"City of Fayetville",14,14,21,null,null,null,null,null,null,null,null,null,null,null,null,null,null,null,null,null,null,null,null,null,null,null,null,null,null,null,null,null,null,null,null,null,null,null,null,null,null,null,null,null,null,null,null,{"$f":"IF(DAY(OFFSET(INDIRECT(ADDRESS(ROW(),COLUMN())),0,-1))>21,BD100+7,IF(DAY(OFFSET(INDIRECT(ADDRESS(ROW(),COLUMN())),0,-1))<7,BD100+0,IF(AND(DAY(OFFSET(INDIRECT(ADDRESS(ROW(),COLUMN())),0,-1))>7,DAY(OFFSET(INDIRECT(ADDRESS(ROW(),COLUMN())),0,-1))<15),BD100+7,BD100+0)))","v":"00:00:00"},null,null,null,null,null,null,null,null,null,null,null,null,null,"2029-04-02",{"$f":"IF(DAY(OFFSET(INDIRECT(ADDRESS(ROW(),COLUMN())),0,-1))>21,BS100+7,IF(DAY(OFFSET(INDIRECT(ADDRESS(ROW(),COLUMN())),0,-1))<7,BS100+0,IF(AND(DAY(OFFSET(INDIRECT(ADDRESS(ROW(),COLUMN())),0,-1))>7,DAY(OFFSET(INDIRECT(ADDRESS(ROW(),COLUMN())),0,-1))<15),BS100+7,BS100+0)))","v":"2029-04-02"},null,"2028-01-31"]
[null,null,null,null,null,"Div 6","City of Lumberton",{"$f":"CP40","v":"2028-09-04"},"City of Lumberton",0,3,10,null,null,null,null,null,null,null,null,null,null,null,null,null,null,null,null,null,null,null,null,null,null,null,null,null,null,null,null,null,null,null,null,null,null,null,null,null,null,null,null,null,null,null,null,{"$f":"IF(DAY(OFFSET(INDIRECT(ADDRESS(ROW(),COLUMN())),0,-1))>21,BD101+7,IF(DAY(OFFSET(INDIRECT(ADDRESS(ROW(),COLUMN())),0,-1))<7,BD101+0,IF(AND(DAY(OFFSET(INDIRECT(ADDRESS(ROW(),COLUMN())),0,-1))>7,DAY(OFFSET(INDIRECT(ADDRESS(ROW(),COLUMN())),0,-1))<15),BD101+7,BD101+0)))","v":"00:00:00"},null,null,null,null,null,null,null,null,null,null,null,null,null,"2029-04-16",{"$f":"IF((DAY(BS101))<DAY(13),BS101+10,IF((DAY(BS101))>=DAY(20),BS101-5,BS101+2))","v":"2029-04-18"},null,"2028-02-14"]
[null,null,null,null,null,"Div 6","Town of Hope Mills",{"$f":"M40","v":"2028-08-21"},"Town of Hope Mills",0,14,10,null,null,null,null,null,null,null,null,null,null,null,null,null,null,null,null,null,null,null,null,null,null,null,null,null,null,null,null,null,null,null,null,null,null,null,null,null,null,null,null,null,null,null,null,{"$f":"IF(DAY(OFFSET(INDIRECT(ADDRESS(ROW(),COLUMN())),0,-1))>21,BD102+7,IF(DAY(OFFSET(INDIRECT(ADDRESS(ROW(),COLUMN())),0,-1))<7,BD102+0,IF(AND(DAY(OFFSET(INDIRECT(ADDRESS(ROW(),COLUMN())),0,-1))>7,DAY(OFFSET(INDIRECT(ADDRESS(ROW(),COLUMN())),0,-1))<15),BD102+7,BD102+0)))","v":"00:00:00"},null,null,null,null,null,null,null,null,null,null,null,null,null,null,{"$f":"IF(DAY(BT101)=DAY(21),BT101-6,BT101+1)","v":"2029-04-19"}]
[null,null,null,null,null,"Div 6","Town of Spring Lake",{"$f":"I34","v":"2028-08-14"},"Town of Spring Lake",14,5,3,null,null,null,null,null,null,null,null,null,null,null,null,null,null,null,null,null,null,null,null,null,null,null,null,null,null,null,null,null,null,null,null,null,null,null,null,null,null,null,null,null,null,null,null,{"$f":"IF(DAY(OFFSET(INDIRECT(ADDRESS(ROW(),COLUMN())),0,-1))>21,BD103+7,IF(DAY(OFFSET(INDIRECT(ADDRESS(ROW(),COLUMN())),0,-1))<7,BD103+0,IF(AND(DAY(OFFSET(INDIRECT(ADDRESS(ROW(),COLUMN())),0,-1))>7,DAY(OFFSET(INDIRECT(ADDRESS(ROW(),COLUMN())),0,-1))<15),BD103+7,BD103+0)))","v":"00:00:00"},null,null,null,null,null,null,null,null,null,null,null,null,null,"2029-04-30",{"$f":"IF(DAY(OFFSET(INDIRECT(ADDRESS(ROW(),COLUMN())),0,-1))>21,BS103+7,IF(DAY(OFFSET(INDIRECT(ADDRESS(ROW(),COLUMN())),0,-1))<7,BS103+0,IF(AND(DAY(OFFSET(INDIRECT(ADDRESS(ROW(),COLUMN())),0,-1))>7,DAY(OFFSET(INDIRECT(ADDRESS(ROW(),COLUMN())),0,-1))<15),BS103+7,BS103+0)))","v":"2029-05-07"},null,"2028-02-28"]
[null,null,null,null,null,"Div 5","Town of Apex",{"$f":"AN40","v":"2028-08-22"},"Town of Apex",0,21,30,null,null,null,null,null,null,null,null,null,null,null,null,null,null,null,null,null,null,null,null,null,null,null,null,null,null,null,null,null,null,null,null,null,null,null,null,null,null,null,null,null,null,null,null,{"$f":"IF(DAY(OFFSET(INDIRECT(ADDRESS(ROW(),COLUMN())),0,-1))>21,BD104+7,IF(DAY(OFFSET(INDIRECT(ADDRESS(ROW(),COLUMN())),0,-1))<7,BD104+0,IF(AND(DAY(OFFSET(INDIRECT(ADDRESS(ROW(),COLUMN())),0,-1))>7,DAY(OFFSET(INDIRECT(ADDRESS(ROW(),COLUMN())),0,-1))<15),BD104+7,BD104+0)))","v":"00:00:00"},null,null,null,null,null,null,null,null,null,null,null,null,null,"2029-05-14",{"$f":"IF((DAY(BS104))<DAY(13),BS104+10,IF((DAY(BS104))>=DAY(20),BS104-5,BS104+2))","v":"2029-05-16"},null,"2028-03-20"]
[null,null,null,null,null,"Div 5","City of Durham",{"$f":"M40","v":"2028-08-21"},"City of Durham",30,28,28,null,null,null,null,null,null,null,null,null,null,null,null,null,null,null,null,null,null,null,null,null,null,null,null,null,null,null,null,null,null,null,null,null,null,null,null,null,null,null,null,null,null,null,null,{"$f":"IF(DAY(OFFSET(INDIRECT(ADDRESS(ROW(),COLUMN())),0,-1))>21,BD105+7,IF(DAY(OFFSET(INDIRECT(ADDRESS(ROW(),COLUMN())),0,-1))<7,BD105+0,IF(AND(DAY(OFFSET(INDIRECT(ADDRESS(ROW(),COLUMN())),0,-1))>7,DAY(OFFSET(INDIRECT(ADDRESS(ROW(),COLUMN())),0,-1))<15),BD105+7,BD105+0)))","v":"00:00:00"},null,null,null,null,null,null,null,null,null,null,null,null,null,null,{"$f":"IF(DAY(BT104)=DAY(21),BT104-6,BT104+1)","v":"2029-05-17"}]
[null,null,null,null,null,"Div 5","City of Raleigh",{"$f":"P40","v":"2028-08-15"},"City of Raleigh",30,7,90,null,null,null,null,null,null,null,null,null,null,null,null,null,null,null,null,null,null,null,null,null,null,null,null,null,null,null,null,null,null,null,null,null,null,null,null,null,null,null,null,null,null,null,null,{"$f":"IF(DAY(OFFSET(INDIRECT(ADDRESS(ROW(),COLUMN())),0,-1))>21,BD106+7,IF(DAY(OFFSET(INDIRECT(ADDRESS(ROW(),COLUMN())),0,-1))<7,BD106+0,IF(AND(DAY(OFFSET(INDIRECT(ADDRESS(ROW(),COLUMN())),0,-1))>7,DAY(OFFSET(INDIRECT(ADDRESS(ROW(),COLUMN())),0,-1))<15),BD106+7,BD106+0)))","v":"00:00:00"},null,null,null,null,null,null,null,null,null,null,null,null,null,"2029-06-04",{"$f":"IF(DAY(OFFSET(INDIRECT(ADDRESS(ROW(),COLUMN())),0,-1))>21,BS106+7,IF(DAY(OFFSET(INDIRECT(ADDRESS(ROW(),COLUMN())),0,-1))<7,BS106+0,IF(AND(DAY(OFFSET(INDIRECT(ADDRESS(ROW(),COLUMN())),0,-1))>7,DAY(OFFSET(INDIRECT(ADDRESS(ROW(),COLUMN())),0,-1))<15),BS106+7,BS106+0)))","v":"2029-06-04"},null,"2028-04-03"]
[null,null,null,null,null,"Div 5","Town of Wake Forest",{"$f":"BL40","v":"2028-08-15"},"Town of Wake Forest",30,30,15,null,null,null,null,null,null,null,null,null,null,null,null,null,null,null,null,null,null,null,null,null,null,null,null,null,null,null,null,null,null,null,null,null,null,null,null,null,null,null,null,null,null,null,null,null,null,null,null,null,null,null,null,null,null,null,null,null,null,"2029-06-18",{"$f":"IF((DAY(BS107))<DAY(13),BS107+10,IF((DAY(BS107))>=DAY(20),BS107-5,BS107+2))","v":"2029-06-20"},null,"2028-04-17"]
[null,null,null,null,null,"Div 5","Town of Holly Springs",{"$f":"BL40","v":"2028-08-15"},"Town of Holly Springs",5,14,14,null,null,null,null,null,null,null,null,null,null,null,null,null,null,null,null,null,null,null,null,null,null,null,null,null,null,null,null,null,null,null,null,null,null,null,null,null,null,null,null,null,null,null,null,null,null,null,null,null,null,null,null,null,null,null,null,null,null,null,{"$f":"IF(DAY(BT107)=DAY(21),BT107-6,BT107+1)","v":"2029-06-21"}]
[null,null,null,null,null,"Div 5","City of Henderson",{"$f":"CV40","v":"2028-07-10"},"City of Henderson",0,28,28,null,null,null,null,null,null,null,null,null,null,null,null,null,null,null,null,null,null,null,null,null,null,null,null,null,null,null,null,null,null,null,null,null,null,null,null,null,null,null,null,null,null,null,null,null,null,null,null,null,null,null,null,null,null,null,null,null,null,"2029-07-02",{"$f":"IF(DAY(OFFSET(INDIRECT(ADDRESS(ROW(),COLUMN())),0,-1))>21,BS109+7,IF(DAY(OFFSET(INDIRECT(ADDRESS(ROW(),COLUMN())),0,-1))<7,BS109+0,IF(AND(DAY(OFFSET(INDIRECT(ADDRESS(ROW(),COLUMN())),0,-1))>7,DAY(OFFSET(INDIRECT(ADDRESS(ROW(),COLUMN())),0,-1))<15),BS109+7,BS109+0)))","v":"2029-07-02"},null,"2028-05-01"]
[null,null,null,null,null,"Div 5","Town of Knightdale",{"$f":"BR55","v":"2028-08-16"},"Town of Knightdale",30,14,21,null,null,null,null,null,null,null,null,null,null,null,null,null,null,null,null,null,null,null,null,null,null,null,null,null,null,null,null,null,null,null,null,null,null,null,null,null,null,null,null,null,null,null,null,null,null,null,null,null,null,null,null,null,null,null,null,null,null,"2029-07-16",{"$f":"IF((DAY(BS110))<DAY(13),BS110+10,IF((DAY(BS110))>=DAY(20),BS110-5,BS110+2))","v":"2029-07-18"},null,"2028-05-15"]
[null,null,null,null,null,"Div 5","Town of Fuquay-Varina",{"$f":"BC40","v":"2028-08-15"},"Town of Fuquay-Varina",10,7,10,null,null,null,null,null,null,null,null,null,null,null,null,null,null,null,null,null,null,null,null,null,null,null,null,null,null,null,null,null,null,null,null,null,null,null,null,null,null,null,null,null,null,null,null,null,null,null,null,null,null,null,null,null,null,null,null,null,null,null,{"$f":"IF(DAY(BT110)=DAY(21),BT110-6,BT110+1)","v":"2029-07-19"}]
[null,null,null,null,null,"Div 5","Town of Garner",{"$f":"P40","v":"2028-08-15"},"Town of Garner",30,7,90,null,null,null,null,null,null,null,null,null,null,null,null,null,null,null,null,null,null,null,null,null,null,null,null,null,null,null,null,null,null,null,null,null,null,null,null,null,null,null,null,null,null,null,null,null,null,null,null,null,null,null,null,null,null,null,null,null,null,"2029-07-30",{"$f":"IF(DAY(OFFSET(INDIRECT(ADDRESS(ROW(),COLUMN())),0,-1))>21,BS112+7,IF(DAY(OFFSET(INDIRECT(ADDRESS(ROW(),COLUMN())),0,-1))<7,BS112+0,IF(AND(DAY(OFFSET(INDIRECT(ADDRESS(ROW(),COLUMN())),0,-1))>7,DAY(OFFSET(INDIRECT(ADDRESS(ROW(),COLUMN())),0,-1))<15),BS112+7,BS112+0)))","v":"2029-08-06"},null,"2028-06-05"]
[null,null,null,null,null,"Div 5","Town of Cary",{"$f":"CD40","v":"2028-08-10"},"Town of Cary",0,7,30,null,null,null,null,null,null,null,null,null,null,null,null,null,null,null,null,null,null,null,null,null,null,null,null,null,null,null,null,null,null,null,null,null,null,null,null,null,null,null,null,null,null,null,null,null,null,null,null,null,null,null,null,null,null,null,null,null,null,"2029-08-20",{"$f":"IF((DAY(BS113))<DAY(13),BS113+10,IF((DAY(BS113))>=DAY(20),BS113-5,BS113+2))","v":"2029-08-15"},null,"2028-06-19"]
[null,null,null,null,null,"Div 5","Town of Morrisville",{"$f":"AN40","v":"2028-08-22"},"Town of Morrisville",15,12,15,null,null,null,null,null,null,null,null,null,null,null,null,null,null,null,null,null,null,null,null,null,null,null,null,null,null,null,null,null,null,null,null,null,null,null,null,null,null,null,null,null,null,null,null,null,null,null,null,null,null,null,null,null,null,null,null,null,null,null,{"$f":"IF(DAY(BT113)=DAY(21),BT113-6,BT113+1)","v":"2029-08-16"}]
[null,null,null,null,null,null,null,null,null,null,null,null,null,null,null,null,null,null,null,null,null,null,null,null,null,null,null,null,null,null,null,null,null,null,null,null,null,null,null,null,null,null,null,null,null,null,null,null,null,null,null,null,null,null,null,null,null,null,null,null,null,null,null,null,null,null,null,null,null,null,"2029-09-03",{"$f":"IF(DAY(OFFSET(INDIRECT(ADDRESS(ROW(),COLUMN())),0,-1))>21,BS115+7,IF(DAY(OFFSET(INDIRECT(ADDRESS(ROW(),COLUMN())),0,-1))<7,BS115+0,IF(AND(DAY(OFFSET(INDIRECT(ADDRESS(ROW(),COLUMN())),0,-1))>7,DAY(OFFSET(INDIRECT(ADDRESS(ROW(),COLUMN())),0,-1))<15),BS115+7,BS115+0)))","v":"2029-09-03"},null,"2028-07-03"]
[null,null,null,null,null,null,null,null,null,null,null,null,null,null,null,null,null,null,null,null,null,null,null,null,null,null,null,null,null,null,null,null,null,null,null,null,null,null,null,null,null,null,null,null,null,null,null,null,null,null,null,null,null,null,null,null,null,null,null,null,null,null,null,null,null,null,null,null,null,null,"2030-09-16",null,null,"2028-07-17"]
[null,null,null,null,null,"Div 4","City of Rocky Mount",{"$f":"I34","v":"2028-08-14"},"City of Rocky Mount",0,14,14]
[null,null,null,null,null,"Div 4","City of Goldsboro",{"$f":"M40","v":"2028-08-21"},"City of Goldsboro",7,14,7,null,null,null,null,null,null,null,null,null,null,null,null,null,null,null,null,null,null,null,null,null,null,null,null,null,null,null,null,null,null,null,null,null,null,null,null,null,null,null,null,null,null,null,null,null,null,null,null,null,null,null,null,null,null,null,null,null,null,null,null,null,"2028-07-31"]
[null,null,null,null,null,"Div 4","City of Roanoke Rapids",{"$f":"P40","v":"2028-08-15"},"City of Roanoke Rapids",5,7,14,null,null,null,null,null,null,null,null,null,null,null,null,null,null,null,null,null,null,null,null,null,null,null,null,null,null,null,null,null,null,null,null,null,null,null,null,null,null,null,null,null,null,null,null,null,null,null,null,null,null,null,null,null,null,null,null,null,null,null,null,null,"2028-08-14"]
[null,null,null,null,null,"Div 4","Town of Clayton",{"$f":"M40","v":"2028-08-21"},"Town of Clayton"]
[null,null,null,null,null,"Div 4","Town of Tarboro",{"$f":"CV40","v":"2028-07-10"},"Town of Tarboro",14,7,14,null,null,null,null,null,null,null,null,null,null,null,null,null,null,null,null,null,null,null,null,null,null,null,null,null,null,null,null,null,null,null,null,null,null,null,null,null,null,null,null,null,null,null,null,null,null,null,null,null,null,null,null,null,null,null,null,null,null,null,null,null,"2028-09-04"]
[null,null,null,null,null,"Div 4","City of Wilson",{"$f":"AZ40","v":"2028-08-17"},"City of Wilson"]
[null,null,null,null,null,"Div 4","Town of Smithfield",{"$f":"P40","v":"2028-08-15"},"Town of Smithfield",0,5,21]
[null,null,null,null,null,"Div 3","City of Wilmington",{"$f":"P40","v":"2028-08-15"},"City of Wilmington",0,30,0]
[null,null,null,null,null,"Div 3","City of Jacksonville",{"$f":"CS40","v":"2028-08-10"},"City of Jacksonville",0,14,7]
[null,null,null,null,null,"Div 3","Town of Leland",{"$f":"BI35","v":"2028-08-17"},"Town of Leland",10,10,10]
[null,null,null,null,null,"Div 2","City of Havelock",{"$f":"I34","v":"2028-08-14"},"City of Havelock",0,5,28]
[null,null,null,null,null,"Div 2","GUC",{"$f":"M40","v":"2028-08-21"},"GUC",0,30,14]
[null,null,null,null,null,"Div 2","City of Kinston",{"$f":"P40","v":"2028-08-15"},"City of Kinston"]
[null,null,null,null,null,"Div 2","City of New Bern",{"$f":"AN40","v":"2028-08-22"},"City of New Bern",0,14,14]
[null,null,null,null,null,"Div 2","Town of Winterville",{"$f":"CV40","v":"2028-07-10"},"Town of Winterville",21,7,7]
[null,null,null,null,null,"Div 1","Elizabeth City",{"$f":"I34","v":"2028-08-14"},"Elizabeth City",0,45,14]
[null,null,null,null,null,"Div 1","Betterment",null,"Betterment",{"$f":"'Cover Sheet'!G4","v":7},{"$f":"'Cover Sheet'!H4","v":14},{"$f":"'Cover Sheet'!I4","v":14}]

{"sheet":"Appendix","index":4,"n_rows":12,"n_cols":9,"rows_kept":12,"cut":false,"hidden":false,"merged":[[2,8,4,14],[7,8,7,14]]}
[null,null,null,"Milestones","Definition"]
[null,null,null,"Start Exhibit Review","This is the date of when the parallel review between NCDOT and the Utility owner/ Municipality starts. Getting Exhibit A, the plan sheet ready.",null,null,null,"To enter your own custom Betterment council meeting times"]
[null,null,null,"Start Agreement","The Start Agreement date is considering the Utility Owner/Municipality review and execution time as well as the DOT execution times to the agreements approved and signed.",null,null,null,"On the Cover Sheet there are buttons on the left hand side to select when your desired municpalitie's council meet. Once a button is clicked it will be highlighted green letting you know it is active. After that you will enter the agenda cutoff, the execution time and the extra review time if needed into the highlighted green cells toward the middle of the screen."]
[null,null,null,"Agreement Sent to Owner","This is the date after two weeks is given for NCDOT Contracts review and approval. Then the agreement is sent to the owner."]
[null,null,null,"Railroad permitting Date","The Railroad permitting should be completed 6 months before PS&E."]
[null,null,null,"DEQ Permitting Date","There is a week allotted for DEQ Permitting."]
[null,null,null,"Owner Board Date","This date is when the agreement should be brought to the Utility Owner/Municipalities’ Council meeting to be discussed."]
[null,null,null,"Agreement NCDOT board Date","Once the agreement is sent to the owner, it will be brought to that Owner’s board meeting as well as the NCDOT board meeting. The spreadsheet will select the next board meeting date based on when the agreement was sent to the owner.",null,null,null,"The UCA Forecasting Spreadsheet is a tool that can predict turn in dates using data collected from Municipalities, DOT reviewers and approval time frames."]
[null,null,null,"Partially Executed","After the board meeting date there is an execution time that is added that could be different for each Utility Owner/Municipality."]
[null,null,null,"Fully Executed","The fully executed date is the date after the Chief is given time to sign."]
[null,null,null,"Project BOT Meeting","The board of transportation meeting takes place on a BOT council meeting day which will be based off what the Owner/Municipality Council meeting date is."]
[null,null,null,"PS&E (Roadway Plans to Cont & Prop)","Plans, Specifications & Estimates - Items that must be turned in 1. All Permits 2. All Agreements (UCA and U&O) 3.UBO plans, UC plans, Special Provisions, Estimates need to be turned in at PS&E, the project cannot LET without these items."]